4,7-dimethyl-4-(1,1-dimethylethyl)octane
- Formula: C14H30
- Molecular weight: 198.3880
- CAS Registry Number: 500020-61-1

Phase change data

Data compiled by: Thermodynamics Research Center, NIST Boulder Laboratories, Chris Muzny director
Quantity | Value | Units | Method | Reference | Comment |
---|---|---|---|---|---|
Tfus | 163. | K | N/A | Petrov, Sushchinskii, et al., 1957 | Uncertainty assigned by TRC = 5. K |

References

Petrov, Sushchinskii, et al., 1957
Petrov, A.D.; Sushchinskii, V.L.; Zakharov, E.P.; Rogozhnikova, T.I.,
Synthesis of Branched ALiphatic C10-C15 Hydrocarbons by the Grignard and the Grignard-Wurtz Reactions,
Zh. Obshch. Khim., 1957, 27, 467. [all data]