4-docosyl-1,1'-biphenyl

Phase change data

Data compiled by: Thermodynamics Research Center, NIST Boulder Laboratories, Chris Muzny director

Quantity Value Units Method Reference Comment
Tfus356.4KN/AMikeska, 1936Uncertainty assigned by TRC = 4. K

In addition to the Thermodynamics Research Center (TRC) data available from this site, much more physical and chemical property data is available from the following TRC products:

References

Mikeska, 1936
Mikeska, L.A., Ind. Eng. Chem., 1936, 28, 970. [all data]