5-butyl-5-(1-methylethyl)nonane
- Formula: C16H34
- Molecular weight: 226.4412
- IUPAC Standard InChIKey: SERMPEIGGDLUAF-UHFFFAOYSA-N
- CAS Registry Number: 500018-61-1
- Chemical structure:
View 3d structure (requires JavaScript / HTML 5) - Species with the same structure:

Phase change data

Data compiled by: Thermodynamics Research Center, NIST Boulder Laboratories, Chris Muzny director
Quantity | Value | Units | Method | Reference | Comment |
---|---|---|---|---|---|
Tfus | 225. | K | N/A | Petrov, 1953 | Uncertainty assigned by TRC = 4. K |
Tfus | 225. | K | N/A | Petrov and Chernyshev, 1952 | Uncertainty assigned by TRC = 5. K |

References

Petrov, 1953
Petrov, A.D.,
Mechanism of Wurtz-Grignard Reaction,
Problemy Mekhanizma Org. Reaktsit, Akad. +Nauk Ukr. S.S.R., 1953, 1953, 113. [all data]
Petrov and Chernyshev, 1952
Petrov; Chernyshev, J.K.,
Dokl. Akad. Nauk SSSR, 1952, 86, 957. [all data]