6-ethyl-6-methyltridecane
- Formula: C16H34
- Molecular weight: 226.4412
- IUPAC Standard InChIKey: BLDWOTJDJUMIMK-UHFFFAOYSA-N
- CAS Registry Number: 500018-54-2
- Chemical structure:
View 3d structure (requires JavaScript / HTML 5) - Species with the same structure:

Phase change data

Data compiled by: Thermodynamics Research Center, NIST Boulder Laboratories, Chris Muzny director
Quantity | Value | Units | Method | Reference | Comment |
---|---|---|---|---|---|
Tfus | 198. | K | N/A | Rabjohn, 1955 | Uncertainty assigned by TRC = 6. K |

References

Rabjohn, 1955
Rabjohn, N.,
Unpublished, Univ. of Missouri, Columbus, 1955. [all data]