5-butyl-5-ethylnonane
- Formula: C15H32
- Molecular weight: 212.4146
- CAS Registry Number: 500018-53-1

Phase change data

Data compiled by: Thermodynamics Research Center, NIST Boulder Laboratories, Chris Muzny director
Quantity | Value | Units | Method | Reference | Comment |
---|---|---|---|---|---|
Tfus | 207. | K | N/A | Petrov, 1953 | Uncertainty assigned by TRC = 5. K |
Tfus | 207. | K | N/A | Petrov and Chernyshev, 1952 | Uncertainty assigned by TRC = 2. K |

References

Petrov, 1953
Petrov, A.D.,
Mechanism of Wurtz-Grignard Reaction,
Problemy Mekhanizma Org. Reaktsit, Akad. +Nauk Ukr. S.S.R., 1953, 1953, 113. [all data]
Petrov and Chernyshev, 1952
Petrov; Chernyshev, J.K.,
Dokl. Akad. Nauk SSSR, 1952, 86, 957. [all data]