nitroethene
- Formula: C2H3NO2
- Molecular weight: 73.0507
- IUPAC Standard InChIKey: RPMXALUWKZHYOV-UHFFFAOYSA-N
- CAS Registry Number: 500016-67-1
- Chemical structure:
View 3d structure (requires JavaScript / HTML 5) - Species with the same structure:

Phase change data

Data compiled by: Thermodynamics Research Center, NIST Boulder Laboratories, Chris Muzny director
Quantity | Value | Units | Method | Reference | Comment |
---|---|---|---|---|---|
Tfus | 217.7 | K | N/A | Hopff and Capaul, 1960 | Uncertainty assigned by TRC = 2. K |

References

Hopff and Capaul, 1960
Hopff, H.; Capaul, M.,
Nitroethylene,
Helv. Chim. Acta, 1960, 43, 1898-1910. [all data]