2,6-dimethyl-2,3-benzanthracene
- Formula: C20H16
- Molecular weight: 256.3410
- IUPAC Standard InChIKey: SBRVAUHNGYMENZ-UHFFFAOYSA-N
- CAS Registry Number: 500016-24-0
- Chemical structure:
View 3d structure (requires JavaScript / HTML 5) - Permanent link for this species. Use this link for bookmarking this species for future reference.

Phase change data

Data compiled by: Thermodynamics Research Center, NIST Boulder Laboratories, Chris Muzny director
Quantity | Value | Units | Method | Reference | Comment |
---|---|---|---|---|---|
Tfus | 638. | K | N/A | Coulson, 1934 | Uncertainty assigned by TRC = 2. K |

References

Coulson, 1934
Coulson, E.A.,
Homologs of Naphthacene I. 2,6-Dimethylnaphthacene,
J. Chem. Soc., 1934, 1934, 1406. [all data]