2-chloro-2,3-dimethyl-3-nitrosobutane
- Formula: C6H12ClNO
- Molecular weight: 149.619
- IUPAC Standard InChIKey: YXNFHDGDFRRMTF-UHFFFAOYSA-N
- CAS Registry Number: 500015-61-2
- Chemical structure:
View 3d structure (requires JavaScript / HTML 5) - Species with the same structure:

Phase change data

Data compiled by: Thermodynamics Research Center, NIST Boulder Laboratories, Chris Muzny director
Quantity | Value | Units | Method | Reference | Comment |
---|---|---|---|---|---|
Tfus | 394.15 | K | N/A | Bruhl, 1897 | Uncertainty assigned by TRC = 2. K |

References

Bruhl, 1897
Bruhl, J.W.,
Spectrochemistry of nitrogen containing compounds V,
Z. Phys. Chem., Stoechiom. Verwandtschaftsl., 1897, 22, 373. [all data]