nitro hexyl amine
- Formula: C6H14N2O2
- Molecular weight: 146.1876
- IUPAC Standard InChIKey: QHELGMHZLODPGT-UHFFFAOYSA-N
- CAS Registry Number: 500015-53-2
- Chemical structure:
View 3d structure (requires JavaScript / HTML 5) - Species with the same structure:

Phase change data

Data compiled by: Thermodynamics Research Center, NIST Boulder Laboratories, Chris Muzny director
Quantity | Value | Units | Method | Reference | Comment |
---|---|---|---|---|---|
Tfus | 279.15 | K | N/A | Bruhl, 1897 | Uncertainty assigned by TRC = 2. K |

References

Bruhl, 1897
Bruhl, J.W.,
Spectrochemistry of nitrogen containing compounds V,
Z. Phys. Chem., Stoechiom. Verwandtschaftsl., 1897, 22, 373. [all data]