d-2-butyl nitrite
- Formula: C4H9NO2
- Molecular weight: 103.1198
- IUPAC Standard InChIKey: NFGNZNFBQAGBJA-UHFFFAOYSA-N
- CAS Registry Number: 500014-80-2
- Chemical structure:
View 3d structure (requires JavaScript / HTML 5) - Species with the same structure:

Phase change data

Data compiled by: Thermodynamics Research Center, NIST Boulder Laboratories, Chris Muzny director
Quantity | Value | Units | Method | Reference | Comment |
---|---|---|---|---|---|
Tboil | 341.15 | K | N/A | Kornblum, Patton, et al., 1948 | Uncertainty assigned by TRC = 2. K |

References

Kornblum, Patton, et al., 1948
Kornblum, N.; Patton, J.T.; Nordmann, J.B.,
The Basis for the Reported Optical Activity of the Salts of Aliphatic Nitro Compounds: 2-Nitrobutane,
J. Am. Chem. Soc., 1948, 70, 746. [all data]