2,3-bis(2,2-dimethylethyl)-1,3-butadiene
- Formula: C12H22
- Molecular weight: 166.3031
- IUPAC Standard InChIKey: NRAJHPUJLXDFGK-UHFFFAOYSA-N
- CAS Registry Number: 500013-24-1
- Chemical structure:
View 3d structure (requires JavaScript / HTML 5) - Species with the same structure:

Phase change data

Data compiled by: Thermodynamics Research Center, NIST Boulder Laboratories, Chris Muzny director
Quantity | Value | Units | Method | Reference | Comment |
---|---|---|---|---|---|
Tboil | 453. | K | N/A | Backer, 1939 | Uncertainty assigned by TRC = 3. K |

References

Backer, 1939
Backer, H.J.,
2,3-di-tert-butylbutadiene,
Recl. Trav. Chim. Pays-Bas, 1939, 58, 643. [all data]