ethyl propyliden amine
- Formula: C5H11N
- Molecular weight: 85.1475
- IUPAC Standard InChIKey: ZVYCPFCNAXPUFP-AATRIKPKSA-N
- CAS Registry Number: 500011-12-1
- Chemical structure:
View 3d structure (requires JavaScript / HTML 5) - Species with the same structure:

Phase change data

Data compiled by: Thermodynamics Research Center, NIST Boulder Laboratories, Chris Muzny director
Quantity | Value | Units | Method | Reference | Comment |
---|---|---|---|---|---|
Tboil | 346.85 | K | N/A | Rau and Narayanaswamy, 1934 | Uncertainty assigned by TRC = 0.5 K |

References

Rau and Narayanaswamy, 1934
Rau, M.A.G.; Narayanaswamy, B.N.,
The determination of dipole moments using the method of diluted solutions: I and II,
Z. Phys. Chem., Abt. B, 1934, 26, 23. [all data]