L(+)-5-methyl-1-heptene
- Formula: C8H16
- Molecular weight: 112.2126
- IUPAC Standard InChIKey: WNEYWVBECXCQRT-UHFFFAOYSA-N
- CAS Registry Number: 500007-01-2
- Chemical structure:
View 3d structure (requires JavaScript / HTML 5) - Species with the same structure:

Phase change data

Data compiled by: Thermodynamics Research Center, NIST Boulder Laboratories, Chris Muzny director
Quantity | Value | Units | Method | Reference | Comment |
---|---|---|---|---|---|
Tboil | 386.65 | K | N/A | Lardicci, Salvadori, et al., 1962 | Uncertainty assigned by TRC = 1.5 K |

References

Lardicci, Salvadori, et al., 1962
Lardicci, L.; Salvadori, R.; Pino, P.,
Preparation of Optically Active Paraffins and Alcohols by Addition of Ethylene to (D)(+)-2-methylbutyl-1-lithium,
Ann. Chim. (Rome), 1962, 52, 652-62. [all data]