5,5-dimethyl-3-hexene (cis,trans unspecified)
- Formula: C8H16
- Molecular weight: 112.2126
- IUPAC Standard InChIKey: JPLZSSHKQZJYTJ-VOTSOKGWSA-N
- CAS Registry Number: 500003-69-0
- Chemical structure:
View 3d structure (requires JavaScript / HTML 5) - Species with the same structure:
- Stereoisomers:

Phase change data

Data compiled by: Thermodynamics Research Center, NIST Boulder Laboratories, Chris Muzny director
Quantity | Value | Units | Method | Reference | Comment |
---|---|---|---|---|---|
Tboil | 373.25 | K | N/A | Goldwasser and Taylor, 1939 | Uncertainty assigned by TRC = 0.6 K |

References

Goldwasser and Taylor, 1939
Goldwasser, S.; Taylor, H.S.,
Catalytic dehydration of c6-c8 aliphatic alcohols,
J. Am. Chem. Soc., 1939, 61, 1751. [all data]