Phenol, 2-methyl-5-(1-methylethyl)-
- Formula: C10H14O
- Molecular weight: 150.2176
- IUPAC Standard InChIKey: RECUKUPTGUEGMW-UHFFFAOYSA-N
- CAS Registry Number: 499-75-2
- Chemical structure:
View 3d structure (requires JavaScript / HTML 5) - Other names: Carvacrol; p-Cymen-2-ol; Antioxine; Isothymol; Karvakrol; 2-Hydroxy-p-cymene; 2-Methyl-5-isopropylphenol; 5-Isopropyl-2-methylphenol; 2-Methyl-5-(1-methylethyl)phenol; o-Cresol, 5-isopropyl-; o-Thymol; p-Cymene, 2-hydroxy-; Isopropyl-o-cresol; Phenol, 5-isopropyl-2-methyl-; 1-Hydroxy-2-methyl-5-isopropylbenzene; 2-p-Cymenol; 5-Isopropyl-o-cresol; 3-Isopropyl-6-methylphenol; Phenol, 3-isopropyl-6-methyl-; Oxycymol; 6-methyl-3-isopropylphenol; NSC 6188

Gas phase thermochemistry data

Data compiled by: Hussein Y. Afeefy, Joel F. Liebman, and Stephen E. Stein
Quantity | Value | Units | Method | Reference | Comment |
---|---|---|---|---|---|
ΔfH°gas | -194.2 | kJ/mol | Ccb | Bertholon, Giray, et al., 1971 | see Lamartine and Perrin, 1969 |

Condensed phase thermochemistry data

Data compiled by: Hussein Y. Afeefy, Joel F. Liebman, and Stephen E. Stein
Quantity | Value | Units | Method | Reference | Comment |
---|---|---|---|---|---|
ΔfH°liquid | -270. | kJ/mol | Ccb | Bertholon, Giray, et al., 1971 | see Lamartine and Perrin, 1969 |
Quantity | Value | Units | Method | Reference | Comment |
ΔcH°liquid | -5665. | kJ/mol | Ccb | Bertholon, Giray, et al., 1971 | see Lamartine and Perrin, 1969; Corresponding ΔfHºliquid = -270. kJ/mol (simple calculation by NIST; no Washburn corrections) |
ΔcH°liquid | -5650. ± 10. | kJ/mol | Ccb | Lamartine and Perrin, 1969 | Corresponding ΔfHºliquid = -290. kJ/mol (simple calculation by NIST; no Washburn corrections) |

Phase change data

Data compiled as indicated in comments:
BS - Robert L. Brown and Stephen E. Stein
TRC - Thermodynamics Research Center, NIST Boulder Laboratories, Chris Muzny director
AC - William E. Acree, Jr., James S. Chickos
ALS - Hussein Y. Afeefy, Joel F. Liebman, and Stephen E. Stein
DRB - Donald R. Burgess, Jr.
Quantity | Value | Units | Method | Reference | Comment |
---|---|---|---|---|---|
Tboil | 510. ± 1. | K | AVG | N/A | Average of 8 values; Individual data points |
Quantity | Value | Units | Method | Reference | Comment |
Tfus | 276.65 | K | N/A | Karr, 1957 | Uncertainty assigned by TRC = 2. K; TRC |
Tfus | 276.65 | K | N/A | Carpenter and Easter, 1955 | Uncertainty assigned by TRC = 2. K; TRC |
Tfus | 273.65 | K | N/A | Gardner, Procofief, et al., 1935 | Uncertainty assigned by TRC = 3. K; TRC |
Quantity | Value | Units | Method | Reference | Comment |
ΔvapH° | 68.2 | kJ/mol | GC | van Roon, Parsons, et al., 2002 | AC |
ΔvapH° | 77.74 | kJ/mol | C | Bertholon, Giray, et al., 1971 | see Lamartine and Perrin, 1969; ALS |
ΔvapH° | 75.8 | kJ/mol | N/A | Bertholon, Giray, et al., 1971 | DRB |
ΔvapH° | 59. ± 3. | kJ/mol | V | Lamartine and Perrin, 1969 | ALS |
Enthalpy of vaporization
ΔvapH (kJ/mol) | Temperature (K) | Method | Reference | Comment |
---|---|---|---|---|
56.5 | 358. | A | Stephenson and Malanowski, 1987 | Based on data from 343. to 510. K. See also Stull, 1947.; AC |
59.4 | 402. | EB | Lamartine and Perrin, 1969, 2 | Based on data from 387. to 512. K.; AC |
Antoine Equation Parameters
log10(P) = A − (B / (T + C))
P = vapor pressure (bar)
T = temperature (K)
View plot Requires a JavaScript / HTML 5 canvas capable browser.
Temperature (K) | A | B | C | Reference | Comment |
---|---|---|---|---|---|
343. to 510. | 5.34179 | 2549.857 | -32.705 | Stull, 1947 | Coefficents calculated by NIST from author's data. |

Kovats' RI, non-polar column, isothermal

Column type | Active phase | Temperature (C) | I | Reference | Comment |
---|---|---|---|---|---|
Capillary | SE-30 | 120. | 1274. | Tudor and Moldovan, 1999 | |
Capillary | SE-30 | 100. | 1273.8 | Tudor, 1997 | 40. m/0.35 mm/0.35 μm |
Capillary | HP-5 | 100. | 1301. | Hennig and Engewald, 1994 | 50. m/0.20 mm/0.33 μm, H2 |
Capillary | HP-5 | 110. | 1301. | Hennig and Engewald, 1994 | 50. m/0.20 mm/0.33 μm, H2 |
Capillary | HP-5 | 120. | 1303. | Hennig and Engewald, 1994 | 50. m/0.20 mm/0.33 μm, H2 |
Capillary | HP-5 | 130. | 1304. | Hennig and Engewald, 1994 | 50. m/0.20 mm/0.33 μm, H2 |
Capillary | HP-5 | 140. | 1306. | Hennig and Engewald, 1994 | 50. m/0.20 mm/0.33 μm, H2 |
Capillary | HP-5 | 150. | 1308. | Hennig and Engewald, 1994 | 50. m/0.20 mm/0.33 μm, H2 |
Capillary | HP-5 | 80. | 1300. | Hennig and Engewald, 1994 | 50. m/0.20 mm/0.33 μm, H2 |
Capillary | HP-5 | 90. | 1300. | Hennig and Engewald, 1994 | 50. m/0.20 mm/0.33 μm, H2 |
Capillary | HP-5 | 100. | 1302. | Hennig and Engewald, 1994 | 50. m/0.20 mm/0.11 μm, H2 |
Capillary | HP-5 | 110. | 1302. | Hennig and Engewald, 1994 | 50. m/0.20 mm/0.11 μm, H2 |
Capillary | HP-5 | 120. | 1303. | Hennig and Engewald, 1994 | 50. m/0.20 mm/0.11 μm, H2 |
Capillary | HP-5 | 130. | 1305. | Hennig and Engewald, 1994 | 50. m/0.20 mm/0.11 μm, H2 |
Capillary | HP-5 | 140. | 1307. | Hennig and Engewald, 1994 | 50. m/0.20 mm/0.11 μm, H2 |
Capillary | HP-5 | 150. | 1309. | Hennig and Engewald, 1994 | 50. m/0.20 mm/0.11 μm, H2 |
Capillary | HP-5 | 80. | 1302. | Hennig and Engewald, 1994 | 50. m/0.20 mm/0.11 μm, H2 |
Capillary | HP-5 | 90. | 1301. | Hennig and Engewald, 1994 | 50. m/0.20 mm/0.11 μm, H2 |

Kovats' RI, non-polar column, temperature ramp

Column type | Active phase | I | Reference | Comment |
---|---|---|---|---|
Capillary | HP-5MS | 1317. | Hazzit, Baaliouamer, et al., 2006 | 30. m/0.25 mm/0.25 μm, He, 60. C @ 8. min, 2. K/min, 280. C @ 30. min |
Capillary | DB-5 | 1298. | Lucero, Fredrickson, et al., 2006 | 30. m/0.25 mm/0.25 μm, He, 3. K/min; Tstart: 60. C |
Capillary | BP-1 | 1283. | Raina, Verma, et al., 2006 | 25. m/0.32 mm/0.25 μm, N2, 5. K/min, 220. C @ 13. min; Tstart: 60. C |
Capillary | BP-1 | 1279. | Srivastava, Srivastava, et al., 2006 | 30. m/0.32 mm/0.25 μm, N2, 5. K/min, 220. C @ 3. min; Tstart: 60. C |
Capillary | DB-5 | 1298. | Adams and Nguyen, 2005 | 30. m/0.26 mm/0.25 μm, He, 3. K/min; Tstart: 60. C; Tend: 246. C |
Capillary | BP-5 | 1301. | Baranauskiene, Venskutonis, et al., 2005 | 50. m/0.32 mm/0.25 μm, He, 50. C @ 2. min, 5. K/min, 260. C @ 5. min |
Capillary | DB-5MS | 1299. | Angioni, Barra, et al., 2004 | 30. m/0.25 mm/0.25 μm, He, 60. C @ 15. min, 3. K/min; Tend: 180. C |
Capillary | SPB-5 | 1300. | Gauvin, Lecomte, et al., 2004 | 60. m/0.32 mm/1. μm, He, 4. K/min, 200. C @ 30. min; Tstart: 60. C |
Capillary | HP-5MS | 1307. | Baranauskiene, Venskutonis, et al., 2003 | 30. m/0.25 mm/0.25 μm, He, 50. C @ 2. min, 4. K/min, 280. C @ 10. min |
Capillary | HP-5 | 1316. | Bouzouita, Kachouri, et al., 2003 | 30. m/0.25 mm/1. μm, He, 40. C @ 1. min, 5. K/min; Tend: 250. C |
Capillary | DB-5 | 1300. | Lucero, Estell, et al., 2003 | 30. m/0.25 mm/0.25 μm, He, 3. K/min; Tstart: 60. C |
Capillary | HP-5 | 1309. | Juliani and Simon, 2002 | 30. m/0.25 mm/0.25 μm, He, 60. C @ 1. min, 4. K/min, 200. C @ 15. min |
Capillary | HP-5 | 1307. | Nickavar, Salehi-Sormagi, et al., 2002 | 30. m/0.25 mm/0.25 μm, He, 4. K/min; Tstart: 60. C; Tend: 275. C |
Capillary | SE-30 | 1302. | Palá-Paúl, Velasco-Negueruela, et al., 2002 | 25. m/0.22 mm/0.25 μm, He, 4. K/min; Tstart: 70. C; Tend: 220. C |
Capillary | BP-1 | 1288. | Raina, Lal, et al., 2002 | 60. m/0.32 mm/0.25 μm, N2, 5. K/min; Tstart: 60. C; Tend: 220. C |
Capillary | BP-1 | 1288. | Raina, Srivastava, et al., 2002 | 25. m/0.55 mm/0.25 μm, N2, 5. K/min, 220. C @ 15. min; Tstart: 60. C |
Capillary | HP-5 | 1298. | Kitic, Palic, et al., 2001 | 25. m/0.32 mm/0.52 μm, H2, 4. K/min; Tstart: 40. C; Tend: 240. C |
Capillary | DB-1 | 1295. | Senatore and Rigano, 2001 | 30. m/0.25 mm/0.25 μm, He, 40. C @ 5. min, 2. K/min, 260. C @ 20. min |
Capillary | DB-5 | 1298. | Adams, 2000 | 30. m/0.26 mm/0.25 μm, He, 3. K/min; Tstart: 60. C; Tend: 240. C |
Capillary | DB-5 | 1298. | Adams, 2000, 2 | 30. m/0.26 mm/0.25 μm, He, 3. K/min; Tstart: 60. C; Tend: 246. C |
Capillary | HP-5MS | 1298. | Roussis, Tsoukatou, et al., 2000 | 30. m/0.25 mm/0.25 μm, He, 3. K/min; Tstart: 60. C; Tend: 280. C |
Capillary | DB-5 | 1299. | Tellez, Estell, et al., 1997 | 30. m/0.25 mm/0.25 μm, He, 3. K/min; Tstart: 60. C; Tend: 240. C |
Capillary | OV-101 | 1278. | Padrayuttawat, Tamura, et al., 1996 | 50. m/0.25 mm/0.2 μm, N2, 2. K/min, 200. C @ 60. min; Tstart: 80. C |
Capillary | DB-5 | 1309. | Andersen, Gagnon, et al., 1995 | 2. K/min; Tstart: 40. C; Tend: 210. C |
Capillary | OV-101 | 1289. | Menut, Molangui, et al., 1995 | N2, 5. K/min; Column length: 25. m; Column diameter: 0.25 mm; Tstart: 50. C; Tend: 200. C |

Kovats' RI, non-polar column, custom temperature program

Column type | Active phase | I | Reference | Comment |
---|---|---|---|---|
Capillary | HP-5MS | 1312. | Alissandrakis E., Tarantilis P.A., et al., 2007 | 30. m/0.25 mm/0.25 μm, He; Program: 40C(3min) => 3C/min => 160C => 10C/min => 200C |
Capillary | BP-1 | 1293. | Dwivedi, Khan, et al., 2004 | 25. m/0.25 mm/0.25 μm, N2; Program: 60C => 5C/min => 220C(5min) => 3C/min => 245C(5min) |
Capillary | HP-5 | 1299. | Daferera, Ziogas, et al., 2003 | 30. m/0.25 mm/0.25 μm, He; Program: 40C (3min) => 3C/min => 180C => 30C/min => 270C (5min) |
Capillary | AT-5 | 1296. | Khouri, Usubillaga, et al., 2000 | 60. m/0.25 mm/0.25 μm, He; Program: 60 C 4K/min -> 200 C 10 K/min -> 280 C |
Capillary | DB-5 | 1298. | Adams, 1998 | 30. m/0.26 mm/0.25 μm; Program: not specified |

Kovats' RI, polar column, temperature ramp

Column type | Active phase | I | Reference | Comment |
---|---|---|---|---|
Capillary | Stabilwax | 2238. | Hazzit, Baaliouamer, et al., 2006 | 30. m/0.32 mm/1. μm, N2, 50. C @ 3. min, 2. K/min, 220. C @ 15. min |
Capillary | HP-Wax | 2233. | Gauvin, Lecomte, et al., 2004 | 50. m/0.2 mm/0.4 μm, He, 4. K/min, 230. C @ 30. min; Tstart: 60. C |
Capillary | Supelcowax-10 | 2225. | Andersen, Gagnon, et al., 1995 | 2. K/min; Tstart: 40. C; Tend: 210. C |

Van Den Dool and Kratz RI, non-polar column, temperature ramp

Column type | Active phase | I | Reference | Comment |
---|---|---|---|---|
Capillary | RTX-1 | 1278. | Bendahou, Muselli, et al., 2008 | 60. m/0.22 mm/0.25 μm, He, 2. K/min, 230. C @ 30. min; Tstart: 60. C |
Capillary | HP-5MS | 1304. | Benkaci-Ali, Baaliouamer, et al., 2007 | 30. m/0.25 mm/0.25 μm, He, 60. C @ 8. min, 2. K/min, 250. C @ 30. min |
Capillary | DB-5 | 1300. | Flamini, Cioni, et al., 2007 | 30. m/0.25 mm/0.25 μm, He, 3. K/min; Tstart: 60. C; Tend: 240. C |
Capillary | HP-5MS | 1294. | Kundakovic, Fokialakis, et al., 2007 | 30. m/0.25 mm/0.25 μm, He, 3. K/min; Tstart: 60. C; Tend: 280. C |
Capillary | DB-5 | 1299. | Maccioni, Baldini, et al., 2007 | 30. m/0.25 mm/0.25 μm, He, 3. K/min; Tstart: 60. C; Tend: 240. C |
Capillary | RTX-1 | 1275. | Paolini J., Costa J., et al., 2007 | 60. m/0.22 mm/0.25 μm, He, 2. K/min, 230. C @ 35. min; Tstart: 60. C |
Capillary | HP-5MS | 1299. | Saroglou, Arfan, et al., 2007 | 30. m/0.25 mm/0.25 μm, He, 60. C @ 5. min, 4. K/min; Tend: 280. C |
Capillary | ZB-5 | 1300. | Simoniatto, Bonani, et al., 2007 | 30. m/0.25 mm/0.25 μm, He, 3. K/min; Tstart: 50. C; Tend: 250. C |
Capillary | DB-1 | 1280. | Sonboli, Azizian, et al., 2007 | 60. m/0.25 mm/0.25 μm, N2, 5. K/min, 250. C @ 10. min; Tstart: 60. C |
Capillary | HP-5MS | 1294.3 | Zeng, Zhao, et al., 2007 | 30. m/0.25 mm/0.25 μm, He, 4. K/min; Tstart: 80. C; Tend: 300. C |
Capillary | HP-5MS | 1295. | Chorianopoulos N., Evergets E., et al., 2006 | 30. m/0.25 mm/0.25 μm, He, 3. K/min; Tstart: 60. C; Tend: 280. C |
Capillary | DB-5 | 1300. | Dob, Dahmane, et al., 2006 | 30. m/0.32 mm/0.25 μm, N2, 60. C @ 3. min, 3. K/min, 240. C @ 5. min |
Capillary | BP-1 | 1276. | Gonny, Cavaleiro, et al., 2006 | 50. m/0.22 mm/0.25 μm, He, 2. K/min, 220. C @ 20. min; Tstart: 60. C |
Capillary | SPB-1 | 1275. | Pinto, Pina-Vaz, et al., 2006 | 30. m/0.2 mm/0.2 μm, He, 3. K/min, 220. C @ 15. min; Tstart: 70. C |
Capillary | HP-5MS | 1311. | Saroglou, Dorizas, et al., 2006 | 30. m/0.25 mm/0.25 μm, He, 60. C @ 5. min, 4. K/min; Tend: 280. C |
Capillary | DB-5 | 1299. | Su, Ho, et al., 2006 | 30. m/0.25 mm/0.25 μm, He, 50. C @ 2. min, 5. K/min; Tend: 250. C |
Capillary | HP-5 | 1302. | Vundac, Pfeifhofer, et al., 2006 | 30. m/0.25 mm/0.25 μm, He, 40. C @ 5. min, 4. K/min; Tend: 300. C |
Capillary | DB-1 | 1289. | Agnaniet, Makani, et al., 2005 | 30. m/0.25 mm/0.25 μm, N2, 5. K/min; Tstart: 50. C; Tend: 200. C |
Capillary | BP-1 | 1273. | Boti J.B., Koukoua G., et al., 2005 | 50. m/0.22 mm/0.25 μm, He, 2. K/min, 220. C @ 20. min; Tstart: 60. C |
Capillary | RTX-1 | 1278. | Cozzani, Muselli, et al., 2005 | 60. m/0.22 mm/0.25 μm, 2. K/min, 220. C @ 20. min; Tstart: 60. C |
Capillary | DB-1 | 1297. | Dob, Dahmane, et al., 2005 | 30. m/0.32 mm/0.25 μm, 50. C @ 8. min, 2. K/min; Tend: 250. C |
Capillary | HP-5 | 1304. | Javidnia, Miri, et al., 2005 | 30. m/0.25 mm/0.25 μm, He, 3. K/min; Tstart: 60. C; Tend: 260. C |
Capillary | HP-5 | 1293. | Mahattanatawee, Goodner, et al., 2005 | 30. m/0.25 mm/0.25 μm, He, 50. C @ 5. min, 4. K/min, 250. C @ 15. min |
Capillary | RTX-1 | 1275. | Paolini, Costa, et al., 2005 | 60. m/0.22 mm/0.25 μm, He, 2. K/min, 230. C @ 35. min; Tstart: 60. C |
Capillary | HP-5MS | 1298. | Pino, Mesa, et al., 2005 | 30. m/0.25 mm/0.25 μm, He, 60. C @ 2. min, 4. K/min, 250. C @ 20. min |
Capillary | DB-5 | 1298. | Senatore, Napolitano, et al., 2005 | 30. m/0.25 mm/0.25 μm, He, 40. C @ 5. min, 2. K/min, 260. C @ 20. min |
Capillary | SE-54 | 1297. | Simionatto, Porto, et al., 2005 | 25. m/0.25 mm/0.2 μm, H2, 4. K/min; Tstart: 50. C; Tend: 250. C |
Capillary | SE-54 | 1300. | Alma, Nitz, et al., 2004 | 30. m/0.25 mm/0.25 μm, He, 60. C @ 5. min, 2. K/min; Tend: 260. C |
Capillary | SPB-1 | 1272. | Antunes, Sevinate-Pinto, et al., 2004 | 30. m/0.25 mm/0.25 μm, He, 3. K/min, 220. C @ 15. min; Tstart: 70. C |
Capillary | HP-5MS | 1295. | Chorianopoulos, Kalpoutzakis, et al., 2004 | 30. m/0.25 mm/0.25 μm, He, 3. K/min; Tstart: 60. C; Tend: 280. C |
Capillary | HP-5 | 1299. | Flamini, Luigi Cioni, et al., 2004 | 30. m/0.25 mm/0.25 μm, N2, 60. C @ 10. min, 5. K/min; Tend: 220. C |
Capillary | HP-5MS | 1297. | Grujic-Jovanovic, Skaltsa, et al., 2004 | 30. m/0.25 mm/0.25 μm, He, 60. C @ 5. min, 4. K/min; Tend: 280. C |
Capillary | HP-5 | 1302. | Javidnia, Miri, et al., 2004 | 30. m/0.25 mm/0.25 μm, He, 3. K/min; Tstart: 60. C; Tend: 260. C |
Capillary | HP-5 | 1304. | Javidnia, Miri, et al., 2004, 2 | He, 3. K/min; Column length: 30. m; Column diameter: 0.25 mm; Tstart: 60. C; Tend: 260. C |
Capillary | DB-5 | 1305. | Javidnia, Miri, et al., 2004, 3 | 30. m/0.25 mm/0.25 μm, He, 3. K/min; Tstart: 60. C; Tend: 260. C |
Capillary | SPB-1 | 1275. | Moldão-Martins, Beirão-da-Costa, et al., 2004 | 30. m/0.2 mm/0.2 μm, He, 3. K/min, 220. C @ 15. min; Tstart: 70. C |
Capillary | SPB-1 | 1275. | Moldão-Martins, Beirão-da-Costa, et al., 2004 | 30. m/0.2 mm/0.2 μm, He, 3. K/min, 220. C @ 15. min; Tstart: 70. C |
Capillary | Methyl Silicone | 1298. | Özcan and Chalchat, 2004 | He, 3. K/min; Column length: 50. m; Column diameter: 0.25 mm; Tstart: 50. C; Tend: 240. C |
Capillary | HP-5MS | 1302. | Salido, Valenzuela, et al., 2004 | 30. m/0.25 mm/0.25 μm, He, 3. K/min; Tstart: 50. C; Tend: 250. C |
Capillary | HP-5 | 1298. | Sartoratto, Machado, et al., 2004 | 25. m/0.2 mm/0.33 μm, He, 3. K/min, 240. C @ 7. min; Tstart: 60. C |
Capillary | BP-1 | 1277. | Tam, Thuam, et al., 2004 | 50. m/0.22 mm/0.25 μm, He, 2. K/min, 220. C @ 20. min; Tstart: 60. C |
Capillary | Optima 5 | 1293. | Vérité, Nacer, et al., 2004 | 25. m/0.25 mm/0.25 μm, He, 3. K/min, 280. C @ 20. min; Tstart: 60. C |
Capillary | HP-5 | 1299. | Angelini, Carpanese, et al., 2003 | 30. m/0.25 mm/0.25 μm, N2, 60. C @ 10. min, 5. K/min; Tend: 220. C |
Capillary | HP-5 | 1299. | Angelini, Carpanese, et al., 2003 | 30. m/0.25 mm/0.25 μm, N2, 60. C @ 10. min, 5. K/min; Tend: 220. C |
Capillary | DB-5 | 1300. | Bader, Flamini, et al., 2003 | 30. m/0.25 mm/0.25 μm, He, 3. K/min; Tstart: 60. C; Tend: 240. C |
Capillary | OV-1 | 1279. | Bicchi, Rubiolo, et al., 2003 | 25. m/0.25 mm/0.3 μm, H2, 50. C @ 1. min, 3. K/min, 200. C @ 20. min |
Capillary | SPB-1 | 1275. | Cavaleiro, Salgueiro, et al., 2003 | 30. m/0.2 mm/0.2 μm, He, 3. K/min, 220. C @ 15. min; Tstart: 70. C |
Capillary | HP-5 | 1299. | Dural, Bagci, et al., 2003 | 30. m/0.25 mm/0.25 μm, N2, 60. C @ 10. min, 5. K/min; Tend: 220. C |
Capillary | DB-1 | 1278. | de Feo, Bruno, et al., 2003 | 30. m/0.25 mm/0.25 μm, He, 40. C @ 5. min, 2. K/min, 250. C @ 20. min |
Capillary | DB-5 | 1296. | Jantan, Ling, et al., 2003 | 30. m/0.25 mm/0.25 μm, He, 75. C @ 10. min, 3. K/min, 230. C @ 20. min |
Capillary | DB-5 | 1301. | Javidnia, Miri, et al., 2003 | He, 4. K/min; Column length: 25. m; Column diameter: 0.25 mm; Tstart: 60. C; Tend: 260. C |
Capillary | HP-5 | 1298. | Karioti, Skaltsa, et al., 2003 | 30. m/0.25 mm/0.25 μm, He, 60. C @ 5. min, 4. K/min; Tend: 280. C |
Capillary | HP-5MS | 1304. | Lalel, Singh, et al., 2003 | 60. m/0.25 mm/0.25 μm, He, 40. C @ 1. min, 3. K/min, 310. C @ 20. min |
Capillary | HP-5 | 1299. | Macchioni, Cioni, et al., 2003 | 30. m/0.25 mm/0.25 μm, He, 3. K/min; Tstart: 60. C; Tend: 240. C |
Capillary | DB-1 | 1278. | Senatore, Lentini, et al., 2003 | 30. m/0.25 mm/0.25 μm, He, 40. C @ 5. min, 2. K/min, 270. C @ 20. min |
Capillary | DB-5 | 1299. | Tampieri, Galuppi, et al., 2003 | 30. m/0.25 mm/0.25 μm, He, 3. K/min; Tstart: 60. C; Tend: 240. C |
Capillary | HP-5 | 1299. | Tsiri, Kretsi, et al., 2003 | 30. m/0.25 mm/0.25 μm, He, 3. K/min; Tstart: 60. C; Tend: 280. C |
Capillary | HP-5 | 1299. | Tsiri, Kretsi, et al., 2003 | 30. m/0.25 mm/0.25 μm, He, 3. K/min; Tstart: 60. C; Tend: 280. C |
Capillary | HP-5 | 1299. | Tzakou, Couladis, et al., 2003 | 30. m/0.25 mm/0.25 μm, He, 3. K/min; Tstart: 60. C; Tend: 280. C |
Capillary | HP-5MS | 1299. | Afsharypuor and Suleimany, 2002 | 30. m/0.25 mm/0.25 μm, He, 4. K/min; Tstart: 60. C; Tend: 275. C |
Capillary | HP-5MS | 1305. | Couladis, Chinou, et al., 2002 | 30. m/0.25 mm/0.25 μm, He, 3. K/min; Tstart: 60. C; Tend: 300. C |
Capillary | HP-5MS | 1298. | Demetzos, Angelopoulou, et al., 2002 | 30. m/0.25 mm/0.25 μm, 50. C @ 5. min, 3. K/min; Tend: 280. C |
Capillary | DB-5 | 1298. | Economakis, Skaltsa, et al., 2002 | 30. m/0.25 mm/0.25 μm, 50. C @ 5. min, 3. K/min; Tend: 280. C |
Capillary | HP-5 | 1300. | Flamini, Cioni, et al., 2002 | 30. m/0.25 mm/0.25 μm, N2, 60. C @ 10. min, 5. K/min; Tend: 220. C |
Capillary | HP-5 | 1298. | Fokialakis, Magiatis, et al., 2002 | 30. m/0.25 mm/0.25 μm, 60. C @ 5. min, 3. K/min; Tend: 280. C |
Capillary | RTX-5 MS | 1300. | Hudaib, Speroni, et al., 2002 | 30. m/0.25 mm/0.25 μm, He, 45. C @ 10. min, 2.5 K/min; Tend: 180. C |
Capillary | DB-5 | 1298. | Javidnia, Miri, et al., 2002 | 30. m/0.25 mm/0.25 μm, He, 4. K/min; Tstart: 60. C; Tend: 260. C |
Capillary | DB-5 | 1298. | Miri, Ramezani, et al., 2002 | He, 4. K/min; Column length: 25. m; Column diameter: 0.25 mm; Tstart: 70. C; Tend: 260. C |
Capillary | CP Sil 5 CB | 1272. | Pino, Marbot, et al., 2002 | 25. m/0.25 mm/0.25 μm, N2, 60. C @ 6. min, 4. K/min; Tend: 280. C |
Capillary | CP Sil 5 CB | 1272. | Pino, Marbot, et al., 2002, 2 | 30. m/0.25 mm/0.25 μm, H2, 60. C @ 10. min, 2. K/min, 280. C @ 40. min |
Capillary | RTX-5 | 1298. | Shellie, Mondello, et al., 2002 | 30. m/0.25 mm/0.25 μm, He, 45. C @ 6. min, 3. K/min; Tend: 250. C |
Capillary | RTX-5 | 1301. | Shellie, Mondello, et al., 2002 | 30. m/0.25 mm/0.25 μm, He, 45. C @ 6. min, 3. K/min; Tend: 250. C |
Capillary | HP-5 | 1300. | Aligiannis, Kalpoutzakis, et al., 2001 | 30. m/0.25 mm/0.25 μm, He, 60. C @ 5. min, 3. K/min; Tend: 280. C |
Capillary | HP-5 | 1301. | Aligiannis, Kalpoutzakis, et al., 2001, 2 | 30. m/0.25 mm/0.25 μm, He, 60. C @ 5. min, 3. K/min; Tend: 280. C |
Capillary | HP-5 | 1298. | Couladis, Tsortanidou, et al., 2001 | 30. m/0.25 mm/0.25 μm, He, 3. K/min; Tstart: 60. C; Tend: 380. C |
Capillary | HP-5 | 1299. | Couladis, Tzakou, et al., 2001 | 30. m/0.25 mm/0.50 μm, He, 3. K/min; Tstart: 60. C; Tend: 280. C |
Capillary | HP-1 | 1297. | Guilliard, Delgado, et al., 2001 | 60. m/0.25 mm/0.25 μm, He, 50. C @ 5. min, 2.5 K/min; Tend: 250. C |
Capillary | HP-5 | 1298. | Guilliard, Delgado, et al., 2001 | 50. m/0.25 mm/0.25 μm, He, 50. C @ 5. min, 2.5 K/min; Tend: 250. C |
Capillary | RTX-5 MS | 1306. | Hudaib, Grazia Bellardi, et al., 2001 | 30. m/0.25 mm/0.25 μm, He, 70. C @ 10. min, 4. K/min, 210. C @ 10. min |
Capillary | HP-5MS | 1302. | Salido, Altarejos, et al., 2001 | 30. m/0.25 mm/0.25 μm, He, 3. K/min; Tstart: 50. C; Tend: 250. C |
Capillary | HP-5MS | 1299. | Skaltsa, Mavrommati, et al., 2001 | 30. m/0.25 mm/0.25 μm, He, 60. C @ 5. min, 4. K/min; Tend: 280. C |
Capillary | HP-5 | 1292. | Lazari, Skaltsa, et al., 2000 | 30. m/0.25 mm/0.25 μm, He, 50. C @ 5. min, 4. K/min; Tend: 280. C |
Capillary | HP-5 | 1302. | Song, Sawamura, et al., 2000 | 30. m/0.25 mm/0.25 μm, He, 2. K/min; Tstart: 70. C; Tend: 230. C |
Capillary | Methyl Silicone | 1299. | Sumathykutty, Rao, et al., 1999 | 50. m/0.25 mm/0.17 μm, N2, 2. K/min; Tstart: 80. C; Tend: 200. C |
Capillary | DB-5 | 1305. | Sagrero-Nieves, Bartley, et al., 1997 | 30. m/0.26 mm/0.25 μm, He, 2. K/min, 225. C @ 20. min; Tstart: 50. C |
Capillary | DB-5 | 1297. | Sakho, Chassagne, et al., 1997 | H2, 60. C @ 3. min, 2. K/min; Column length: 30. m; Column diameter: 0.25 mm; Tend: 220. C |
Capillary | OV-1 | 1269.4 | Gautzsch and Zinn, 1996 | 8. K/min; Tstart: 35. C; Tend: 300. C |
Capillary | OV-101 | 1277. | Yang, Sugisawa, et al., 1992 | N2, 2. K/min; Column length: 50. m; Column diameter: 0.25 mm; Tstart: 80. C; Tend: 200. C |
Capillary | OV-101 | 1278. | Yang, Sugisawa, et al., 1992 | N2, 2. K/min; Column length: 50. m; Column diameter: 0.25 mm; Tstart: 80. C; Tend: 200. C |

Van Den Dool and Kratz RI, non-polar column, custom temperature program

Column type | Active phase | I | Reference | Comment |
---|---|---|---|---|
Capillary | HP-5MS | 1291. | Pérez, Navarro, et al., 2007 | 30. m/0.25 mm/0.25 μm, He; Program: 50C(4min) => 10C/min => 200C(0.5min) => 20C/min => 260C(5min) |
Capillary | DB-5 | 1285. | Basile, Senatore, et al., 2006 | 30. m/0.25 mm/0.25 μm; Program: 40C(5min) => 2C/min => 250C(15min) => 10C/min => 270C |
Capillary | VF-5MS | 1315. | Mjøs, Meier, et al., 2006 | 50. m/0.25 mm/0.25 μm, He; Program: 60C(2min) => 30C/min => 100C => 1C/min => |
Capillary | VF-5MS | 1315.8 | Mjøs, Meier, et al., 2006 | 50. m/0.25 mm/0.25 μm, He; Program: 60C(2min) => 30C/min => 100C => 2C/min => |
Capillary | VF-5MS | 1317. | Mjøs, Meier, et al., 2006 | 50. m/0.25 mm/0.25 μm, He; Program: 60C(2min) => 30C/min => 100C => 4C/min => |
Capillary | HP-5MS | 1299. | Akpulat, Tepe, et al., 2005 | 30. m/0.25 mm/0.25 μm, He; Program: 50C (3min) => 3C/min => 200C => 6C/min => 240C |
Capillary | 5 % Phenyl methyl siloxane | 1299. | Sacchetti, Maietti, et al., 2005 | 30. m/0.32 mm/0.15 μm, He; Program: 45C => 1C/min => 100C => 5C/min => 250C (10min) |
Capillary | SE-52 | 1300. | Frizzo, Lorenzo, et al., 2004 | 25. m/0.32 mm/0.43 μm, H2; Program: 60C(8min) => 3C/min => 180C => 20C/min => 250C(10min) |
Capillary | SE-52 | 1302. | Mondello, Dugo, et al., 1995 | 60. m/0.32 mm/0.40 μm, He; Program: 45 C (6 min) 3 C/min -> 111 0C 2 C/min -> 160 C 3 C/min -> 300 C (15 min) |

Van Den Dool and Kratz RI, polar column, temperature ramp

Column type | Active phase | I | Reference | Comment |
---|---|---|---|---|
Capillary | RTX-Wax | 2219. | Bendahou, Muselli, et al., 2008 | 60. m/0.22 mm/0.25 μm, He, 2. K/min, 230. C @ 30. min; Tstart: 60. C |
Capillary | HP-Innowax | 2225. | Kundakovic, Fokialakis, et al., 2007 | 30. m/0.25 mm/0.25 μm, He, 3. K/min; Tstart: 60. C; Tend: 280. C |
Capillary | RTX-Wax | 2183. | Paolini J., Costa J., et al., 2007 | 60. m/0.22 mm/0.25 μm, He, 2. K/min, 230. C @ 35. min; Tstart: 60. C |
Capillary | BP-20 | 2215. | Gonny, Cavaleiro, et al., 2006 | 50. m/0.22 mm/0.25 μm, He, 2. K/min, 220. C @ 20. min; Tstart: 60. C |
Capillary | Supelcowax-10 | 2212. | Pinto, Pina-Vaz, et al., 2006 | 30. m/0.2 mm/0.2 μm, He, 3. K/min, 220. C @ 15. min; Tstart: 70. C |
Capillary | BP-20 | 2214. | Boti J.B., Koukoua G., et al., 2005 | 50. m/0.22 mm/0.25 μm, He, 2. K/min, 220. C @ 20. min; Tstart: 60. C |
Capillary | DB-Wax | 2222. | Choi, 2005 | 60. m/0.25 mm/0.25 μm, N2, 70. C @ 2. min, 2. K/min, 230. C @ 20. min |
Capillary | RTX-Wax | 2195. | Cozzani, Muselli, et al., 2005 | 60. m/0.22 mm/0.25 μm, 2. K/min, 220. C @ 20. min; Tstart: 60. C |
Capillary | RTX-Wax | 2183. | Paolini, Costa, et al., 2005 | 60. m/0.22 mm/0.25 μm, He, 2. K/min, 230. C @ 35. min; Tstart: 60. C |
Capillary | HP-Wax | 2219. | Flamini, Luigi Cioni, et al., 2004 | 30. m/0.25 mm/0.25 μm, N2, 60. C @ 10. min, 5. K/min; Tend: 220. C |
Capillary | HP-Innowax | 2215. | Grujic-Jovanovic, Skaltsa, et al., 2004 | 30. m/0.25 mm/0.5 μm, He, 3. K/min; Tstart: 60. C; Tend: 260. C |
Capillary | BP-20 | 2209. | Tam, Thuam, et al., 2004 | 50. m/0.22 mm/0.25 μm, He, 2. K/min, 220. C @ 20. min; Tstart: 60. C |
Capillary | DB-Wax | 2189. | Varming, Andersen, et al., 2004 | 30. m/0.25 mm/0.25 μm, He, 40. C @ 10. min, 6. K/min, 240. C @ 25. min |
Capillary | Supelcowax | 2186. | Bassole, Ouattara, et al., 2003 | 30. m/0.25 mm/0.25 μm, He, 2. K/min, 240. C @ 10. min; Tstart: 40. C |
Capillary | Carbowax 20M | 2223. | Bicchi, Rubiolo, et al., 2003 | 25. m/0.25 mm/0.3 μm, He, 50. C @ 1. min, 3. K/min, 200. C @ 20. min |
Capillary | HP-Innowax | 2219. | Tzakou, Couladis, et al., 2003 | 30. m/0.25 mm/0.5 μm, He, 3. K/min; Tstart: 60. C; Tend: 260. C |
Capillary | Innowax | 2219. | Couladis, Chinou, et al., 2002 | 30. m/0.25 mm/0.5 μm, He, 3. K/min, 260. C @ 10. min; Tstart: 60. C |
Capillary | HP-Innowax | 2219. | Couladis, Tzakou, et al., 2001 | 30. m/0.25 mm/0.50 μm, He, 3. K/min; Tstart: 60. C; Tend: 260. C |
Capillary | DB-Wax | 2225. | Choi and Sawamura, 2000 | 60. m/0.25 mm/0.25 μm, N2, 70. C @ 2. min, 2. K/min, 230. C @ 20. min |
Capillary | Carbowax 20M | 2186. | Mondello, Dugo, et al., 1995 | 60. m/0.32 mm/0.425 μm, He, 45. C @ 3. min, 3. K/min, 300. C @ 20. min |

Normal alkane RI, non-polar column, temperature ramp

Column type | Active phase | I | Reference | Comment |
---|---|---|---|---|
Capillary | HP-1 | 1300. | Alizadeh and Shaabani, 2012 | 30. m/0.25 mm/0.25 μm, Helium, 3. K/min; Tstart: 60. C; Tend: 240. C |
Capillary | RTX-1 | 1278. | Bendiabdellah, El Amine Dib, et al., 2012 | 60. m/0.22 mm/0.25 μm, Helium, 2. K/min, 230. C @ 5. min; Tstart: 60. C |
Capillary | Mega-5 | 1300. | Dell'Agli, Sanna, et al., 2012 | 25. m/0.25 mm/0.25 μm, Helium, 50. C @ 1. min, 3. K/min, 220. C @ 5. min |
Capillary | Polydimethyl siloxane with 5 % Ph | 1290. | Priya, Prathapan, et al., 2012 | Helium, 5. K/min, 200. C @ 25. min; Column length: 30. m; Tstart: 80. C |
Capillary | HP-5 MS | 1312. | Zouari, Ayadi, et al., 2012 | 30. m/0.25 mm/0.25 μm, Helium, 50. C @ 1. min, 7. K/min, 250. C @ 5. min |
Capillary | CP-Sil 5 CB | 1299. | Ameen, Usman, et al., 2011 | 25. m/0.25 mm/0.15 μm, Helium; Tstart: 50. C; Tend: 220. C |
Capillary | DB-5 | 1301. | Cao, Li, et al., 2011 | 30. m/0.25 mm/0.25 μm, Helium, 40. C @ 5. min, 3. K/min, 250. C @ 20. min |
Capillary | DB-1 | 1301. | Fathi, Sahari, et al., 2011 | 30. m/0.25 mm/0.25 μm, Helium, 5. K/min; Tstart: 40. C; Tend: 210. C |
Capillary | CP-Sil 5 CB | 1284. | Mothana, Hasson, et al., 2011 | 30. m/0.25 mm/0.26 μm, Nitrogen, 3. K/min, 280. C @ 22. min; Tstart: 45. C |
Capillary | DB-5 MS | 1299. | Chalchat, Figueredo, et al., 2010 | 25. m/0.30 mm/0.25 μm, Helium, 3. K/min; Tstart: 50. C; Tend: 240. C |
Capillary | DB-5 MS | 1299. | Chalchat, Figueredo, et al., 2010 | 25. m/0.30 mm/0.25 μm, Helium, 3. K/min; Tstart: 50. C; Tend: 240. C |
Capillary | DB-1 | 1289. | Hajimahdipoor, Samadi, et al., 2010 | 30. m/0.25 mm/0.25 μm, Helium, 50. C @ 1. min, 2.5 K/min, 265. C @ 20. min |
Capillary | DB-5 | 1299. | Ho, Wang, et al., 2010 | 30. m/0.25 mm/0.25 μm, Helium, 2. K/min; Tstart: 50. C; Tend: 250. C |
Capillary | DB-5 | 1287. | Jardim, Jham, et al., 2010 | 30. m/0.25 mm/0.25 μm, Nitrogen, 60. C @ 1. min, 3. K/min, 240. C @ 9. min |
Capillary | HP-5 MS | 1305. | Lazarevic, Radulovic, et al., 2010 | 30. m/0.25 mm/0.25 μm, Helium, 5. K/min; Tstart: 70. C; Tend: 290. C |
Capillary | HP-5 | 1327. | Monsef-Esfahani, Miri, et al., 2010 | 30. m/0.25 mm/0.25 μm, Helium, 50. C @ 5. min, 3. K/min; Tend: 240. C |
Capillary | HP-5 MS | 1304. | Radulovic, Blagojevic, et al., 2010 | 30. m/0.25 mm/0.25 μm, Helium, 5. K/min, 290. C @ 10. min; Tstart: 70. C |
Capillary | HP-5 MS | 1290. | Radulovic, Dordevic, et al., 2010 | 30. m/0.25 mm/0.25 μm, Helium, 5. K/min, 290. C @ 10. min; Tstart: 70. C |
Capillary | CP Sil 5 CB | 1298. | Usman, Zubair, et al., 2010 | 25. m/0.25 mm/0.15 μm, 3. K/min; Tstart: 50. C; Tend: 230. C |
Capillary | DB-1 | 1269. | Xu, Tang, et al., 2010 | 30. m/0.25 mm/0.25 μm, Helium, 50. C @ 2. min, 4. K/min, 220. C @ 2. min |
Capillary | DB-5 | 1299. | Alim, Goze, et al., 2009 | 30. m/0.25 mm/0.25 μm, Helium, 3. K/min; Tstart: 60. C; Tend: 240. C |
Capillary | HP-5 MS | 1293. | Kim and Chung, 2009 | 30. m/0.25 mm/0.25 μm, Helium, 35. C @ 5. min, 2. K/min, 195. C @ 30. min |
Capillary | DB-5 | 1299. | Koba, Catherine, et al., 2009 | 30. m/0.25 mm/0.25 μm, Helium, 5. K/min; Tstart: 50. C; Tend: 250. C |
Capillary | HP-5 | 1298. | Maridass, 2009 | 25. m/0.20 mm/0.33 μm, Helium, 3. K/min, 240. C @ 7. min; Tstart: 60. C |
Capillary | DB-1 MS | 1278. | Seo, Kim, et al., 2009 | 30. m/0.25 mm/0.25 μm, Helium, 40. C @ 1. min, 6. K/min, 250. C @ 4. min |
Capillary | HP-5 MS | 1303. | Zaibunnisa, Norashikin, et al., 2009 | 30. m/0.25 mm/0.25 μm, Helium, 60. C @ 6. min, 10. K/min, 325. C @ 10. min |
Capillary | DB-5 | 1297. | Jardin, Jham, et al., 2008 | 30. m/0.25 mm/0.25 μm, Nitrogen, 60. C @ 1. min, 3. K/min, 240. C @ 9. min |
Capillary | SLB-5 MS | 1299. | Lo Presti, Sciarrone, et al., 2008 | 30. m/0.25 mm/0.25 μm, Helium, 50. C @ 2. min, 3. K/min, 250. C @ 10. min |
Capillary | ZB-1 | 1277. | Mierendorff, Stahl-Biskup, et al., 2008 | 30. m/0.25 mm/0.25 μm, Nitrogen, 3. K/min; Tstart: 45. C; Tend: 230. C |
Capillary | SLB-5MS | 1326. | Risticevic, Carasek, et al., 2008 | 10. m/0.18 mm/0.18 μm, Helium, 40. C @ 1.5 min, 10. K/min; Tend: 295. C |
Capillary | HP-5 MS | 1298. | Adams, Beauchamp, et al., 2007 | 30. m/0.25 mm/0.25 μm, Helium, 50. C @ 10. min, 3. K/min, 230. C @ 10. min |
Capillary | HP-5MS | 1298. | Bozin B., Mlmica-Dukic N., et al., 2007 | 30. m/0.25 mm/0.25 μm, He, 3. K/min; Tstart: 60. C; Tend: 280. C |
Capillary | DB-5 | 1297. | El-Ghorab A., El-Massry K.F., et al., 2007 | 30. m/0.25 mm/0.25 μm, He, 3. K/min, 220. C @ 40. min; Tstart: 35. C |
Capillary | HP-5MS | 1300. | Ferhat, Tigrine-Kordjani, et al., 2007 | 30. m/0.25 mm/0.25 μm, He, 60. C @ 8. min, 2. K/min, 250. C @ 15. min |
Capillary | HP-1 | 1273. | Hachicha, Skanji, et al., 2007 | 30. m/0.25 mm/0.25 μm, He, 2. K/min, 240. C @ 20. min; Tstart: 60. C |
Capillary | RTX-5 MS | 1302. | Hudaib and Aburjai, 2007 | 30. m/0.25 mm/0.25 μm, He, 3. K/min; Tstart: 45. C; Tend: 210. C |
Capillary | HP-5 | 1303. | Oliveira, Leitão, et al., 2007 | 25. m/0.2 mm/0.33 μm, H2, 3. K/min; Tstart: 60. C; Tend: 240. C |
Capillary | HP-5 | 1304. | Ristic, Krivokuca-Dokic, et al., 2007 | 30. m/0.25 mm/0.25 μm, Helium, 4. K/min; Tstart: 40. C; Tend: 260. C |
Capillary | DB-5 | 1300. | Sefidkon, Abbasi, et al., 2007 | 30. m/0.25 mm/0.25 μm, He, 4. K/min; Tstart: 50. C; Tend: 240. C |
Capillary | HP-5 MS | 1299. | Vagionas, Graikou, et al., 2007 | 30. m/0.25 mm/0.25 μm, Helium, 3. K/min; Tstart: 60. C; Tend: 280. C |
Capillary | HP-5MS | 1303.2 | Zizovic, Stamenic, et al., 2007 | 30. m/0.25 mm/0.25 μm, He, 4. K/min; Tstart: 40. C; Tend: 260. C |
Capillary | HP-5 | 1279. | Abdelwahed, Hayder, et al., 2006 | 30. m/0.25 mm/0.25 μm, N2, 50. C @ 3. min, 9. K/min, 280. C @ 3. min |
Capillary | HP-5 | 1283. | Abdelwahed, Hayder, et al., 2006 | 30. m/0.25 mm/0.25 μm, N2, 50. C @ 3. min, 9. K/min, 280. C @ 3. min |
Capillary | CP Sil 5 CB | 1278. | Ayoub, Al-Azizi, et al., 2006 | He, 10. K/min; Column length: 25. m; Tstart: 80. C; Tend: 270. C |
Capillary | ZB-5 | 1297. | Biondi, Sari, et al., 2006 | 30. m/0.25 mm/0.25 μm, 2. K/min; Tstart: 40. C; Tend: 300. C |
Capillary | BP-1 | 1275. | Boti, Yao, et al., 2006 | 50. m/0.22 mm/0.25 μm, 2. K/min, 220. C @ 20. min; Tstart: 60. C |
Capillary | HP-5MS | 1299. | Bozin, Mimicá-Dukic, et al., 2006 | 30. m/0.25 mm/0.25 μm, He, 3. K/min; Tstart: 60. C; Tend: 280. C |
Capillary | HP-5 | 1312. | Figuérédo, Cabassu, et al., 2006 | 30. m/0.25 mm/0.25 μm, He, 50. C @ 5. min, 5. K/min, 300. C @ 5. min |
Capillary | DB-1 | 1297. | Gohari, Hadjiakhoondi, et al., 2006 | 60. m/0.25 mm/0.25 μm, He, 60. C @ 2. min, 5. K/min; Tend: 240. C |
Capillary | DB-5 | 1298. | Gohari, Hadjiakhoondi, et al., 2006 | 30. m/0.25 mm/0.25 μm, He, 60. C @ 2. min, 5. K/min; Tend: 240. C |
Capillary | DB-1 | 1297. | Gohari A.R., Hadjiakhoondi A., et al., 2006 | 60. m/0.25 mm/0.25 μm, He, 60. C @ 2. min, 5. K/min; Tend: 240. C |
Capillary | DB-5 | 1298. | Gohari A.R., Hadjiakhoondi A., et al., 2006 | 30. m/0.25 mm/0.25 μm, He, 60. C @ 2. min, 5. K/min; Tend: 240. C |
Capillary | CP Sil 5 CB | 1299. | Hymete, Rohloff, et al., 2006 | 30. m/0.25 mm/0.25 μm, 3. K/min, 220. C @ 3. min; Tstart: 40. C |
Capillary | HP-5 | 1299. | Kucuk, Gulec, et al., 2006 | 30. m/0.32 mm/0.25 μm, Helium, 60. C @ 2. min, 5. K/min, 260. C @ 13. min |
Capillary | HP-5 MS | 1280. | Marzouk, Mansour, et al., 2006 | 30. m/0.25 mm/0.25 μm, Nitrogen, 5. K/min, 280. C @ 5. min; Tstart: 50. C |
Capillary | HP-5 | 1280. | Marzouk, Neffati, et al., 2006 | 30. m/0.25 mm/0.52 μm, N2, 5. K/min, 280. C @ 5. min; Tstart: 50. C |
Capillary | HP-5 | 1297. | Miyazawa and Kawata, 2006 | 30. m/0.32 mm/0.25 μm, Helium, 4. K/min, 240. C @ 5. min; Tstart: 40. C |
Capillary | DB-5 | 1299. | Morteza-Semnani, Akbarzadeh, et al., 2006 | 30. m/0.25 mm/0.25 μm, He, 4. K/min; Tstart: 60. C; Tend: 220. C |
Capillary | DB-5 | 1302. | Morteza-Semnani, Saeedi, et al., 2006 | 30. m/0.25 mm/0.25 μm, He, 60. C @ 4. min, 4. K/min; Tend: 260. C |
Capillary | DB-5 | 1301. | Morteza-Semnani K., Saeedi M., et al., 2006 | 30. m/0.25 mm/0.25 μm, He, 60. C @ 5. min, 4. K/min; Tend: 220. C |
Capillary | CP-Sil 5 CB | 1276. | Olawore, Usman, et al., 2006 | 25. m/0.25 mm/0.15 μm, Hydrogen, 3. K/min; Tstart: 50. C; Tend: 230. C |
Capillary | NB-30 | 1286. | Orav, Raal, et al., 2006 | 30. m/0.2 mm/0.25 μm, He, 2. K/min; Tstart: 50. C; Tend: 250. C |
Capillary | HP-5 | 1315. | Pintore G., Chessa M., et al., 2006 | 30. m/0.25 mm/0.25 μm, He, 60. C @ 10. min, 5. K/min; Tend: 220. C |
Capillary | DB-5 | 1297. | Pino, Marbot, et al., 2006 | 30. m/0.25 mm/0.25 μm, Hydrogen, 70. C @ 4. min, 4. K/min; Tend: 280. C |
Capillary | ZB-5 | 1297. | Sari M., Biondi D.M., et al., 2006 | 30. m/0.25 mm/0.25 μm, He, 2. K/min; Tstart: 40. C; Tend: 300. C |
Capillary | DB-5 | 1301. | Sefidkon, Abbasi, et al., 2006 | 30. m/0.25 mm/0.25 μm, He, 4. K/min; Tstart: 50. C; Tend: 240. C |
Capillary | DB-5 | 1301. | Sefidkon, Abbasi, et al., 2006 | 30. m/0.25 mm/0.25 μm, He, 4. K/min; Tstart: 50. C; Tend: 240. C |
Capillary | DB-5 | 1297. | Sefidkon and Jamzad, 2006 | 30. m/0.25 mm/0.25 μm, He, 4. K/min; Tstart: 40. C; Tend: 240. C |
Capillary | DB-5 | 1299. | Senatore, Landolfi, et al., 2006 | 30. m/0.25 mm/0.25 μm, He, 40. C @ 5. min, 2. K/min, 260. C @ 20. min |
Capillary | DB-1 | 1297. | Tohar, Mohd, et al., 2006 | 30. m/0.32 mm/0.25 μm, 60. C @ 3. min, 3. K/min, 230. C @ 10. min |
Capillary | HP-5MS | 1289. | Basta, Tzakou, et al., 2005 | 30. m/0.25 mm/0.25 μm, He, 3. K/min; Tstart: 60. C; Tend: 280. C |
Capillary | HP-1 | 1278. | Bendimerad and Bendiab, 2005 | 50. m/0.2 mm/0.5 μm, He, 2. K/min, 250. C @ 60. min; Tstart: 60. C |
Capillary | DB-5 | 1297. | Bos, Stojanova, et al., 2005 | 30. m/0.249 mm/0.25 μm, He, 3. K/min; Tstart: 60. C; Tend: 290. C |
Capillary | Methyl Silicone | 1300. | Chalchat and Özcan, 2005 | He, 3. K/min; Column length: 60. m; Column diameter: 0.3 mm; Tstart: 50. C; Tend: 240. C |
Capillary | HP-5 | 1312. | Figuérédo, Cabassu, et al., 2005 | 30. m/0.25 mm/0.25 μm, He, 50. C @ 5. min, 5. K/min, 300. C @ 5. min |
Capillary | RSL-200 | 1299. | Jirovetz, Buchbauer, et al., 2005 | 30. m/0.25 mm/0.25 μm, 40. C @ 2. min, 6. K/min, 280. C @ 10. min |
Capillary | DB-5 | 1292. | Khayyat and Karimi, 2005 | He, 3. K/min; Column length: 30. m; Column diameter: 0.32 mm; Tstart: 60. C; Tend: 240. C |
Capillary | DB-5 | 1300. | Khayyat and Karimi, 2005 | He, 3. K/min; Column length: 30. m; Column diameter: 0.32 mm; Tstart: 60. C; Tend: 240. C |
Capillary | DB-5 | 1298. | Morteza-Semnani, Akbarzadeh, et al., 2005 | 30. m/0.25 mm/0.25 μm, He, 60. C @ 5. min, 4. K/min; Tend: 220. C |
Capillary | DB-5 | 1299. | Morteza-Semnani and Saeedi, 2005 | 30. m/0.25 mm/0.25 μm, He, 60. C @ 4. min, 4. K/min; Tend: 220. C |
Capillary | DB-5 | 1297. | Najafpour Navaei, Mirza, et al., 2005 | 30. m/0.25 mm/0.25 μm, He, 50. C @ 5. min, 3. K/min; Tend: 250. C |
Capillary | CP Sil 5 CB | 1279. | Ogunwande, Olawore, et al., 2005 | 25. m/0.25 mm/0.15 μm, 3. K/min; Tstart: 50. C; Tend: 230. C |
Capillary | DB-5 | 1295. | Özel, Gögüs, et al., 2005 | 30. m/0.32 mm/0.25 μm, He, 40. C @ 0.5 min, 5. K/min, 250. C @ 2. min |
Capillary | HP-5MS | 1299. | Petrakis, Roussis, et al., 2005 | 3. K/min; Column length: 30. m; Column diameter: 0.2 mm; Tstart: 60. C; Tend: 280. C |
Capillary | DB-5 | 1298. | Salehi, Sefidkon, et al., 2005 | 30. m/0.25 mm/0.25 μm, He, 60. C @ 4. min, 3. K/min; Tend: 220. C |
Capillary | DB-5 | 1297. | Sefidkon and Jamzad, 2005 | He, 4. K/min; Column length: 30. m; Column diameter: 0.25 mm; Tstart: 40. C; Tend: 240. C |
Capillary | DB-5 | 1300. | Senatore, Apostolides Arnold, et al., 2005 | 30. m/0.25 mm/0.25 μm, He, 40. C @ 5. min, 2. K/min, 260. C @ 20. min |
Capillary | DB-5 | 1299. | Skoula and Grayer, 2005 | 30. m/0.25 mm/0.25 μm, He, 3. K/min, 230. C @ 20. min; Tstart: 60. C |
Capillary | HP-5MS | 1303. | Slavkovska, Couladis, et al., 2005 | 30. m/0.25 mm/0.25 μm, He, 3. K/min; Tstart: 60. C; Tend: 280. C |
Capillary | CP Sil 8 CB | 1294. | Suárez, Vásquez, et al., 2005 | He, 60. C @ 5. min, 3. K/min; Column length: 30. m; Column diameter: 0.25 mm; Tend: 290. C |
Capillary | HP-5MS | 1272. | Tzakou, Bazos, et al., 2005 | 30. m/0.25 mm/0.25 μm, He, 3. K/min; Tstart: 60. C; Tend: 280. C |
Capillary | DB-5 | 1275. | Tzakou and Constantinidis, 2005 | 30. m/0.32 mm/0.25 μm, He, 3. K/min; Tstart: 60. C; Tend: 280. C |
Capillary | HP-5 | 1284. | Aghel, Yamini, et al., 2004 | 30. m/0.25 mm/0.32 μm, He, 60. C @ 3. min, 5. K/min; Tend: 250. C |
Capillary | BP-1 | 1273. | Blanc, Muselli, et al., 2004 | 50. m/0.22 mm/0.25 μm, 2. K/min, 220. C @ 20. min; Tstart: 60. C |
Capillary | HP-5 MS | 1328. | Ghannadi, Sajjadi, et al., 2004 | 30. m/0.25 mm/0.25 μm, Helium, 4. K/min; Tstart: 60. C; Tend: 275. C |
Capillary | HP-5MS | 1296. | Hajhashemi V., Ghannadi A., et al., 2004 | 30. m/0.25 mm/0.25 μm, He, 4. K/min; Tstart: 60. C; Tend: 275. C |
Capillary | DB-5 | 1298. | Kalvandi, Sefidkon, et al., 2004 | 60. m/0.25 mm/0.25 μm, He, 40. C @ 4. min, 4. K/min; Tend: 280. C |
Capillary | DB-5 | 1299. | Palá-Paúl, Brophy, et al., 2004 | 30. m/0.25 mm/0.25 μm, He, 3. K/min; Tstart: 35. C; Tend: 220. C |
Capillary | DB-1 | 1287. | Palá-Paúl, Velasco-Negueruela, et al., 2004 | 50. m/0.25 mm/0.25 μm, N2, 4. K/min; Tstart: 95. C; Tend: 240. C |
Capillary | DB-1 | 1275. | Park, Lee, et al., 2004 | 60. m/0.32 mm/0.25 μm, He, 35. C @ 4. min, 2. K/min, 230. C @ 25. min |
Capillary | DB-1 | 1277. | Park, Lee, et al., 2004 | 60. m/0.32 mm/0.25 μm, He, 35. C @ 4. min, 2. K/min, 230. C @ 25. min |
Capillary | DB-1 | 1277. | Park, Lee, et al., 2004 | 60. m/0.32 mm/0.25 μm, He, 35. C @ 4. min, 2. K/min, 230. C @ 25. min |
Capillary | DB-1 | 1277. | Park, Lee, et al., 2004 | 60. m/0.32 mm/0.25 μm, He, 35. C @ 4. min, 2. K/min, 230. C @ 25. min |
Capillary | NB-30 | 1292. | Raal, Paaver, et al., 2004 | 50. m/0.20 mm/0.25 μm, He, 2. K/min; Tstart: 50. C; Tend: 250. C |
Capillary | HP-5MS | 1291. | Sadeghpour, Asghari, et al., 2004 | 30. m/0.25 mm/0.25 μm, He, 4. K/min; Tstart: 60. C; Tend: 280. C |
Capillary | DB-5 | 1297. | Sefidkon, Jamzad, et al., 2004 | 30. m/0.25 mm/0.25 μm, 50. C @ 5. min, 3. K/min; Tend: 250. C |
Capillary | DB-5 | 1296. | Tellez, Khan, et al., 2004 | 30. m/0.25 mm/0.25 μm, He, 3. K/min; Tstart: 60. C; Tend: 240. C |
Capillary | BPX-5 | 1325. | Vilaseca, Guy, et al., 2004 | 25. m/0.22 mm/1. μm, He, 60. C @ 5. min, 3. K/min, 250. C @ 10. min |
Capillary | HP-5MS | 1298. | Afsharypuor and Jahromy, 2003 | 30. m/0.25 mm/0.25 μm, He, 4. K/min; Tstart: 60. C; Tend: 275. C |
Capillary | HP-5MS | 1295. | Couladis, Özcan, et al., 2003 | 30. m/0.25 mm/0.25 μm, He, 3. K/min; Tstart: 60. C; Tend: 280. C |
Capillary | DB-1 | 1280. | Ebrahimzadeh, Yamini, et al., 2003 | 60. m/0.25 mm/0.25 μm, He, 4. K/min; Tstart: 50. C; Tend: 250. C |
Capillary | HP-5 | 1302. | Ghannadi and Zolfaghari, 2003 | 30. m/0.25 mm/0.25 μm, He, 4. K/min; Tstart: 60. C; Tend: 275. C |
Capillary | RSL-200 | 1292. | Jirovetz, Buchbauer, et al., 2003 | 30. m/0.32 mm/0.25 μm, H2, 40. C @ 5. min, 6. K/min, 280. C @ 5. min |
Capillary | DB-5 | 1297. | Juteau, Jerkovic, et al., 2003 | 50. m/0.2 mm/0.25 μm, He, 50. C @ 2. min, 3. K/min, 220. C @ 10. min |
Capillary | SE-30 | 1254. | Kambouche and El-Abed, 2003 | 12. m/0.22 mm/0.3 μm, He, 3. K/min; Tstart: 70. C; Tend: 220. C |
Capillary | DB-5MS | 1299. | Maia, Taveira, et al., 2003 | 30. m/0.25 mm/0.25 μm, He, 3. K/min; Tstart: 60. C; Tend: 240. C |
Capillary | DB-5 | 1296. | Masotti, Juteau, et al., 2003 | 50. m/0.2 mm/0.25 μm, He, 50. C @ 2. min, 3. K/min; Tend: 220. C |
Capillary | ZB-1 | 1277. | Mierendorff, Stahl-Biskup, et al., 2003 | 30. m/0.25 mm/0.25 μm, N2, 3. K/min; Tstart: 45. C; Tend: 230. C |
Capillary | HP-5 | 1296. | Mookdasanit, Tamura, et al., 2003 | Helium, 2. K/min, 210. C @ 60. min; Column length: 30. m; Column diameter: 0.32 mm; Tstart: 70. C |
Capillary | DB-1 | 1291. | Perez-Alonso, Velasco-Negueruela, et al., 2003 | 50. m/0.25 mm/0.25 μm, N2, 4. K/min; Tstart: 95. C; Tend: 240. C |
Capillary | DB-5 | 1298. | Pino, Marbot, et al., 2003 | 30. m/0.25 mm/0.25 μm, H2, 60. C @ 10. min, 4. K/min, 280. C @ 40. min |
Capillary | HP-5 | 1287. | Pitarokili, Tzakou, et al., 2003 | 30. m/0.25 mm/0.25 μm, He, 3. K/min; Tstart: 60. C; Tend: 280. C |
Capillary | DB-1 | 1282. | Rasooli and Mirmostafa, 2003 | 60. m/0.25 mm/0.25 μm, He, 4. K/min; Tstart: 40. C; Tend: 220. C |
Capillary | DB-1 | 1282. | Rasooli and Mirmostafa, 2003 | 60. m/0.25 mm/0.25 μm, He, 4. K/min; Tstart: 40. C; Tend: 220. C |
Capillary | HP-5 | 1299. | Velickovic, Randjelovic, et al., 2003 | 25. m/0.32 mm/0.53 μm, H2, 4. K/min; Tstart: 40. C; Tend: 280. C |
Capillary | HP-5 | 1303. | Velickovic, Randjelovic, et al., 2003 | 25. m/0.32 mm/0.53 μm, H2, 4. K/min; Tstart: 40. C; Tend: 280. C |
Capillary | HP-5 | 1291. | Velickovic, Ristic, et al., 2003 | 25. m/0.32 mm/0.53 μm, Helium, 4. K/min; Tstart: 40. C; Tend: 280. C |
Capillary | HP-5 | 1292. | Velickovic, Ristic, et al., 2003 | 25. m/0.32 mm/0.53 μm, Helium, 4. K/min; Tstart: 40. C; Tend: 280. C |
Capillary | HP-5 | 1299. | Velickovic, Ristic, et al., 2003 | 25. m/0.32 mm/0.53 μm, Helium, 4. K/min; Tstart: 40. C; Tend: 280. C |
Capillary | HP-5 | 1300. | Velickovic, Ristic, et al., 2003 | 25. m/0.32 mm/0.53 μm, Helium, 4. K/min; Tstart: 40. C; Tend: 280. C |
Capillary | CP Sil 5 CB | 1273. | Azaz. D., Demirci, et al., 2002 | 25. m/0.25 mm/0.4 μm, N2, 5. K/min, 260. C @ 40. min; Tstart: 60. C |
Capillary | DB-1 | 1272. | Baher, Mirza, et al., 2002 | 60. m/0.25 mm/0.25 μm, He, 4. K/min; Tstart: 60. C; Tend: 220. C |
Capillary | HP-1 | 1275. | Cavaleiro, Salgueiro, et al., 2002 | 30. m/0.25 mm/0.25 μm, He, 3. K/min, 220. C @ 15. min; Tstart: 70. C |
Capillary | DB-5 | 1298. | Farah, Fechtal, et al., 2002 | 30. m/0.25 mm/0.25 μm, N2, 4. K/min; Tstart: 50. C; Tend: 250. C |
Capillary | HP-5 | 1307. | Ghannadi, Sajjadi, et al., 2002 | 30. m/0.25 mm/0.25 μm, He, 4. K/min; Tstart: 60. C; Tend: 275. C |
Capillary | BP-1 | 1282. | Hayes R.A., Richardson B.J., et al., 2002 | 25. m/0.2 mm/0.1 μm, He, 40. C @ 5. min, 8. K/min; Tend: 250. C |
Capillary | CP Sil 8 CB | 1307. | Juteau, Masotti, et al., 2002 | 30. m/0.25 mm/0.25 μm, He, 50. C @ 2. min, 3. K/min; Tend: 220. C |
Capillary | DB-5 | 1298. | Kobaisy, Tellez, et al., 2002 | 30. m/0.25 mm/0.25 μm, He, 3. K/min; Tstart: 60. C; Tend: 240. C |
Capillary | DB-5 | 1299. | Morteza-Semnani, Saeedi, et al., 2002 | 30. m/0.25 mm/0.25 μm, He, 60. C @ 5. min, 4. K/min; Tend: 220. C |
Capillary | HP-5 | 1314. | Novak, Langbehn, et al., 2002 | 30. m/0.25 mm/0.25 μm, 3. K/min; Tstart: 60. C; Tend: 240. C |
Capillary | HP-5 | 1325. | Novak, Langbehn, et al., 2002 | 30. m/0.25 mm/0.25 μm, 3. K/min; Tstart: 60. C; Tend: 240. C |
Capillary | DB-1 | 1282. | Velasco-Negueruela, Pérez-Alonso, et al., 2002 | 50. m/0.25 mm/0.25 μm, N2, 3. K/min; Tstart: 60. C; Tend: 240. C |
Capillary | SPB-5 | 1307. | Cornu, Carnat, et al., 2001 | He, 40. C @ 5. min, 3. K/min, 220. C @ 15. min; Column length: 60. m; Column diameter: 0.32 mm |
Capillary | HP-5 | 1299. | Flamini, Cioni, et al., 2001 | 30. m/0.25 mm/0.25 μm, N2, 60. C @ 10. min, 5. K/min; Tend: 220. C |
Capillary | HP-5 | 1300. | Gallori, Flamini, et al., 2001 | 30. m/0.25 mm/0.25 μm, N2, 60. C @ 10. min, 5. K/min; Tend: 220. C |
Capillary | RTX-1 | 1283. | Kalemba, Marschall, et al., 2001 | 30. m/0.25 mm/0.25 μm, N2, 4. K/min; Tstart: 60. C; Tend: 300. C |
Capillary | OV-101 | 1291. | Orav and Kann, 2001 | He, 2. K/min; Column length: 50. m; Column diameter: 0.2 mm; Tstart: 50. C; Tend: 250. C |
Capillary | DB-1 | 1272. | Palá-Paúl, Pérez-Alonso, et al., 2001 | 30. m/0.25 mm/0.25 μm, N2, 4. K/min; Tstart: 80. C; Tend: 225. C |
Capillary | PTE-5 | 1298. | Stojanovic, Palic, et al., 2001 | 60. m/0.32 mm/0.3 μm, H2, 4.3 K/min; Tstart: 60. C; Tend: 285. C |
Capillary | OV-101 | 1277. | Yang, 2001 | N2, 2. K/min; Column length: 50. m; Column diameter: 0.25 mm; Tstart: 80. C; Tend: 200. C |
Capillary | OV-101 | 1277. | Yang, 2001, 2 | N2, 2. K/min; Column length: 50. m; Column diameter: 0.25 mm; Tstart: 80. C; Tend: 200. C |
Capillary | CP Sil 5 CB | 1271. | Baser, Özek, et al., 2000 | 25. m/0.25 mm/0.4 μm, He, 60. C @ 40. min, 5. K/min; Tend: 260. C |
Capillary | CP Sil 5 CB | 1271. | Baser, Özek, et al., 2000 | 25. m/0.25 mm/0.4 μm, He, 60. C @ 40. min, 5. K/min; Tend: 260. C |
Capillary | BP-1 | 1297. | Mohagheghzadeh, Shams-Ardakani, et al., 2000 | 25. m/0.33 mm/1.0 μm, N2, 4. K/min; Tstart: 60. C; Tend: 275. C |
Capillary | HP-5 | 1311. | Mohagheghzadeh, Shams-Ardakani, et al., 2000, 2 | 30. m/0.25 mm/0.25 μm, He, 4. K/min; Tstart: 60. C; Tend: 275. C |
Capillary | DB-1 | 1279. | Senatore, Napolitano, et al., 2000 | 30. m/0.25 mm/0.25 μm, He, 40. C @ 5. min, 2. K/min, 260. C @ 2. min |
Capillary | OV-101 | 1280. | Tamura, Boonbumrung, et al., 2000 | Nitrogen, 40. C @ 10. min, 2. K/min; Column length: 50. m; Column diameter: 0.25 mm; Tend: 200. C |
Capillary | SE-30 | 1329. | Ali N.A.M. and Jantan, 1999 | He, 3. K/min; Column length: 25. m; Column diameter: 0.2 mm; Tstart: 60. C; Tend: 230. C |
Capillary | OV-101 | 1287. | Dzumayev, Tkachenko, et al., 1999 | 52. m/0.26 mm/0.13 μm, Helium, 50. C @ 0. min, 3. K/min, 220. C @ 0. min |
Capillary | OV-101 | 1299. | Menon, Chacko, et al., 1999 | N2, 1. K/min, 200. C @ 20. min; Column length: 50. m; Column diameter: 0.2 mm; Tstart: 80. C |
Capillary | DB-5 | 1303. | Mockute and Bernotiene, 1999 | He, 40. C @ 1. min, 4. K/min; Column length: 30. m; Column diameter: 0.25 mm; Tend: 230. C |
Capillary | SE-30 | 1329. | Mohd and Jantan, 1999 | He, 60. C @ 10. min, 3. K/min; Column length: 25. m; Column diameter: 0.2 mm; Tend: 230. C |
Capillary | DB-1 | 1283. | Sefidkon, Dabiri, et al., 1999 | 60. m/0.25 mm/0.25 μm, He, 40. C @ 5. min, 4. K/min; Tend: 280. C |
Capillary | DB-1 | 1282. | Shafiee, Javidnia, et al., 1999 | He, 3. K/min, 230. C @ 5. min; Column length: 60. m; Column diameter: 0.32 mm; Tstart: 60. C |
Capillary | DB-5 | 1299. | Tellez, Canel, et al., 1999 | 30. m/0.25 mm/0.25 μm, He, 3. K/min; Tstart: 60. C; Tend: 240. C |
Capillary | CP Sil 5 CB | 1278. | Weyerstahl, Marschall, et al., 1999 | N2, 5. K/min; Column length: 25. m; Phase thickness: 0.39 μm; Tstart: 60. C; Tend: 220. C |
Capillary | OV-101 | 1301. | Zenkevich, Kosman, et al., 1999 | He, 6. K/min; Column length: 25. m; Column diameter: 0.20 mm; Tstart: 80. C; Tend: 240. C |
Capillary | SPB-5 | 1299. | Doneanu and Anitescu, 1998 | 50. m/0.32 mm/0.25 μm, He, 3. K/min, 240. C @ 20. min; Tstart: 60. C |
Capillary | SE-30 | 1296. | Jantan, Ahmad, et al., 1998 | He, 60. C @ 10. min, 3. K/min; Column length: 25. m; Column diameter: 0.2 mm; Tend: 180. C |
Capillary | OV-101 | 1294. | Zollo, Biyiti, et al., 1998 | 5. K/min; Column length: 25. m; Column diameter: 0.32 mm; Tstart: 50. C; Tend: 200. C |
Capillary | OV-1 | 1294. | Kökdil, Kurucu, et al., 1997 | 30. m/0.32 mm/0.25 μm, He, 40. C @ 4. min, 2. K/min; Tend: 270. C |
Capillary | DB-1 | 1286. | Salgueiro, Vila, et al., 1997 | 6. K/min; Tstart: 80. C; Tend: 220. C |
Capillary | DB-5 | 1297.6 | Gawdzik, Mardarowicz, et al., 1996 | 30. m/0.25 mm/0.25 μm, 60. C @ 2. min, 4. K/min, 300. C @ 5. min |
Capillary | DB-1 | 1307. | Stashenko, Puertas, et al., 1996 | 60. m/0.25 mm/0.25 μm, He, 50. C @ 5. min, 2.5 K/min; Tend: 250. C |
Capillary | OV-101 | 1280. | Dzumayev, Tsibulskaya, et al., 1995 | He, 3. K/min; Column length: 52. m; Column diameter: 0.26 mm; Tstart: 50. C; Tend: 220. C |
Capillary | DB-1 | 1290. | Sagrero-Nieves, Bartley, et al., 1994 | 60. m/0.32 mm/0.50 μm, 2. K/min; Tstart: 50. C; Tend: 225. C |
Capillary | OV-101 | 1277. | Tamura, Yang, et al., 1993 | 2. K/min; Column length: 50. m; Column diameter: 0.25 mm; Tstart: 80. C; Tend: 200. C |
Capillary | OV-101 | 1278. | Tamura, Yang, et al., 1993 | 2. K/min; Column length: 50. m; Column diameter: 0.25 mm; Tstart: 80. C; Tend: 200. C |
Capillary | CP Sil 8 CB | 1301. | Jantan and Goh, 1990 | 60. C @ 10. min, 3. K/min; Column length: 25. m; Column diameter: 0.20 mm; Tend: 230. C |
Capillary | BP-1 | 1275. | Wyllie, Brophy, et al., 1990 | 45. C @ 3. min, 3. K/min; Column length: 25. m; Column diameter: 0.33 mm; Tend: 180. C |
Capillary | OV-101 | 1278. | Yang and Sugisawa, 1990 | N2, 2. K/min; Column length: 50. m; Column diameter: 0.25 mm; Tstart: 80. C; Tend: 200. C |
Capillary | OV-101 | 1278. | Yang and Sugisawa, 1990 | N2, 2. K/min; Column length: 50. m; Column diameter: 0.25 mm; Tstart: 80. C; Tend: 200. C |
Capillary | OV-101 | 1275. | Sugisawa, Yang, et al., 1989 | N2, 2. K/min; Column length: 50. m; Column diameter: 0.25 mm; Tstart: 80. C; Tend: 200. C |
Capillary | OV-101 | 1278. | Sugisawa, Yang, et al., 1989 | N2, 2. K/min; Column length: 50. m; Column diameter: 0.25 mm; Tstart: 80. C; Tend: 200. C |
Capillary | OV-101 | 1278. | Nykanen, 1986 | 40. C @ 5. min, 3.5 K/min; Column length: 50. m; Column diameter: 0.30 mm; Tend: 230. C |
Capillary | OV-101 | 1278. | Nykanen, 1986 | 40. C @ 5. min, 3.5 K/min; Column length: 50. m; Column diameter: 0.30 mm; Tend: 230. C |
Capillary | OV-101 | 1302. | Nykanen, 1986 | 40. C @ 5. min, 3.5 K/min; Column length: 50. m; Column diameter: 0.30 mm; Tend: 230. C |
Capillary | OV-101 | 1300. | Stern, Flath, et al., 1985 | 50. C @ 0.1 min, 4. K/min, 225. C @ 30. min; Column length: 50. m; Column diameter: 0.32 mm |

Normal alkane RI, non-polar column, custom temperature program

Column type | Active phase | I | Reference | Comment |
---|---|---|---|---|
Capillary | TR-5 MS | 1308. | Kurashov, Mitrukova, et al., 2014 | 15. m/0.25 mm/0.25 μm, Helium; Program: 35 0C (3 min) 2 0C/min -> 60 0C (3 min) 2 0C/min -> 80 0C (3 min) 4 0C/min -> 120 0C (3 min) 5 0C/min -> 150 0C (3 min) 15 0C/min -> 240 0C (10 min) |
Capillary | DB-5 MS | 1304. | Purushothaman and Ravi, 2013 | 30. m/0.25 mm/0.25 μm, Helium; Program: 70 0C 5 0C/min -> 120 0C 10 0C/min -> 280 0C (20 min) |
Capillary | DB-1 | 1286. | Albano, Lima, et al., 2012 | 30. m/0.25 mm/0.25 μm, Hydrogen; Program: 45 0C 3 0C/min -> 175 0C 15 0C/min -> 300 0C (10 min) |
Capillary | HP-5 MS | 1302. | Attia, Grissa, et al., 2012 | 30. m/0.25 mm/0.25 μm, Helium; Program: 40 0C (5 min) 6 0C -> 120 0C (5 min) 8 0C/min -> 300 0C |
Capillary | RTX-1 | 1278. | Bendiabdellah, El Amine Dib, et al., 2012 | 60. m/0.22 mm/0.25 μm, Helium; Program: not specified |
Capillary | Mega-5 | 1299. | Dell'Agli, Sanna, et al., 2012 | 25. m/0.25 mm/0.25 μm, Helium; Program: not specified |
Capillary | Polydimethyl siloxane with 5 % Ph groups | 1304. | Robinson, Adams, et al., 2012 | Program: not specified |
Capillary | Polydimethyl siloxane with 5 % Ph groups | 1306. | Robinson, Adams, et al., 2012 | Program: not specified |
Capillary | HP-5 MS | 1300. | Sharopov, Sulaimonova, et al., 2012 | 30. m/0.25 mm/0.25 μm, Helium; Program: 40 0C (10 min) 3 0C/min -> 200 0C 2 0C/min -> 220 0C |
Capillary | HP-5 MS | 1298. | Bai, Liu, et al., 2011 | 30. m/0.25 mm/0.25 μm, Helium; Program: 60 0C (1 min) 10 0C/min -> 180 0C (1 min) 20 0C/min -> 280 0C (15 min) |
Capillary | DB-5 | 1303. | Cao, Li, et al., 2011 | 30. m/0.25 mm/0.25 μm, Helium; Program: not specified |
Capillary | DB-1 | 1298. | Fathi, Sahari, et al., 2011 | 30. m/0.25 mm/0.25 μm, Helium; Program: 50 0C (5 min) 3 0C/min -> 240 0C 15 0C/min -> 300 0C (3 min) |
Capillary | HP-5 | 1296. | Laribi, Kouki, et al., 2011 | 30. m/0.25 mm/0.25 μm, Nitrogen; Program: 35 0C (10 min) 3 0C/min -> 205 0C 10 0C/min -> 225 0C |
Capillary | DB-1 | 1278. | Xu, Tang, et al., 2010 | 30. m/0.25 mm/0.25 μm, Helium; Program: not specified |
Capillary | DB-1 | 1278. | Delort and Jaquier, 2009 | 60. m/0.25 mm/0.25 μm, Helium; Program: 50 0C (5 min) 3 0C/min -> 120 0C 5 0C/min -> 250 0C (3 min) 15 0C/min -> 300 0C (20 min) |
Capillary | HP-5 MS | 1301. | Keefover-Ring, Thompson, et al., 2009 | 30. m/0.25 mm/0.25 μm, Helium; Program: 50 0C (5 min) 6 0C/min -> 125 0C 10 0C/min -> 170 0C |
Capillary | HP-5 MS | 1299. | Mancini, Arnold, et al., 2009 | 30. m/0.25 mm/0.25 μm, Helium; Program: 40 0C (5 min) 2 0C/min -> 270 0C -> 260 0C (20 min) |
Capillary | DB-1 | 1286. | Mendes, Trindade, et al., 2009 | 30. m/0.25 mm/0.25 μm, Hydrogen; Program: 45 0C 3 0C/min -> 175 0C 15 0C/min -> 300 0C (10 min) |
Capillary | DB-1 | 1286. | Mendes, Trindade, et al., 2009, 2 | 30. m/0.25 mm/0.25 μm, Hydrogen; Program: 45 0C 3 0C/min -> 175 0C 15 0C/min -> 300 0C (10 min) |
Capillary | HP-5 | 1296. | Riahi, Pourbasheer, et al., 2009 | Column length: 30. m; Column diameter: 0.32 mm; Program: not specified |
Capillary | SLB-5 MS | 1300. | Costa, De Fina, et al., 2008 | 30. m/0.25 mm/0.25 μm, Helium; Program: 50 0C 3 0C/min -> 250 0C (1 min) 10 0C/min -> 300 0C (5 min) |
Capillary | SLB-5 MS | 1298. | Costa, De Fina, et al., 2008 | 30. m/0.25 mm/0.25 μm, Helium; Program: not specified |
Capillary | SLB-5 MS | 1299. | Lo Presti, Sciarrone, et al., 2008 | 30. m/0.25 mm/0.25 μm, Helium; Program: not specified |
Capillary | SLB-5MS | 1317. | Risticevic, Carasek, et al., 2008 | 10. m/0.18 mm/0.18 μm, Helium; Program: not specified |
Capillary | DB-5 MS | 1297. | Silva, Doria, et al., 2008 | 30. m/0.25 mm/0.25 μm; Program: 80 0C (1.5 min) 4 pC/min -> 180 0C 10 0C/min -> 300 0C (10 min) |
Capillary | DB-1 | 1299. | Albuquerque, Vasconcelos Silva, et al., 2007 | 30. m/0.25 mm/0.1 μm, He; Program: 35C => 4C/min => 180C => 10C/min => 250C |
Capillary | HP-5MS | 1305. | Cole, Haber, et al., 2007 | 30. m/0.25 mm/0.25 μm, He; Program: 40C(10min) => 3C/min => 200C => 2C/min => 220C |
Capillary | SPB-1 | 1274. | Díaz-Maroto, Castillo, et al., 2007 | 50. m/0.25 mm/0.25 μm; Program: 70C(3min) => 4C/min => 120C => 8C/min => 250C(5min) |
Capillary | SPB-1 | 1274. | Díaz-Maroto, Castillo, et al., 2007 | 50. m/0.25 mm/0.25 μm; Program: 70C(3min) => 4C/min => 120C => 8C/min => 250C(5min) |
Capillary | HP-5MS | 1299. | Formisano, Mignola, et al., 2007 | 30. m/0.25 mm/0.25 μm, He; Program: 40C(5min) => 2C/min => 250C(15min) => 10C/min => 270C |
Capillary | HP-5 MS | 1299. | Formisano, Rigano, et al., 2007 | 30. m/0.25 mm/0.25 μm, Helium; Program: 40 0C (5 min) 2 0C/min -> 250 0C (15 min) 10 0C/min -> 270 0C |
Capillary | HP-5 | 1303. | Liolios, Laouer, et al., 2007 | Program: not specified |
Capillary | HP-5 | 1299. | Ristic, Krivokuca-Dokic, et al., 2007 | 30. m/0.25 mm/0.25 μm, Helium; Program: not specified |
Capillary | HP-5MS | 1300. | Formisano C., Senatore F., et al., 2006 | 30. m/0.25 mm/0.25 μm, He; Program: 40C(5min) => 2C/min => 250C(15min) => 10C/min => 270C |
Capillary | HP-5 | 1318. | Goodner, Mahattanatawee, et al., 2006 | 30. m/0.25 mm/0.25 μm; Program: >2.5C/min => 180C => 100C/min => 250C (7.3min) |
Capillary | HP-5 | 1314. | Jordan, Martinez, et al., 2006 | 30. m/0.25 mm/0.25 μm, He; Program: 60C(4min) => 1C/min => 64C => 2.5C/min => 155C => 5C/min => 250C |
Capillary | HP-5 | 1299. | Kucuk, Gulec, et al., 2006 | 30. m/0.32 mm/0.25 μm, Helium; Program: not specified |
Capillary | HP-5 | 1314. | Martinez, Madrid, et al., 2006 | 30. m/0.25 mm/0.25 μm; Program: not specified |
Capillary | HP-5 MS | 1297. | Schmidt, Noletto, et al., 2006 | 30. m/0.25 mm/0.25 μm, Helium; Program: 40 0C (10 min) 3 0C/min -> 200 0C 2 0C/min -> 220 0C |
Capillary | DB-5 | 1298. | Srivastava, Mallavarapu, et al., 2006 | 30. m/0.32 mm/0.25 μm, He; Program: 60C => 2C/min => 100C => 3C/min => 160C => 5C/min => 280C |
Capillary | SE-52 | 1299. | Tognolini, Barocelli, et al., 2006 | 30. m/0.32 mm/0.15 μm, He; Program: 45C => 1C/min => 100C => 5C/min => 250C (10min) |
Capillary | DB-5MS | 1288. | Bagci and Baser, 2005 | 30. m/0.25 mm/0.25 μm; Program: 70C(2min) => 10C/min => 150C(15min) => 5C/min => 240C |
Capillary | DB-1 | 1286. | Belhattab, Larous, et al., 2005 | 30. m/0.25 mm/0.25 μm, He; Program: 45C => 3C/min => 175C => 15C/min => 300C(10min) |
Capillary | CP Sil 8 CB | 1298. | Butkienë, Nivinskienë, et al., 2005 | 50. m/0.32 mm/0.25 μm, He; Program: 50C(5min) => 2C/min => 90C => 15C/min => 240C(4min) |
Capillary | DB-1 | 1286. | Faleio, Miguel, et al., 2005 | 30. m/0.25 mm/0.25 μm, He; Program: 45C => 3C/min => 175C => 15C/min => 300C (10min) |
Capillary | DB-5 | 1281. | Hamm, Bleton, et al., 2005 | 30. m/0.25 mm/0.25 μm, He; Program: 40C(1min) => 9C/min => 130C => 2C/min => 230C |
Capillary | CP Sil 8 CB | 1298. | Radudienë, Judpintienë, et al., 2005 | 50. m/0.32 mm/0.25 μm, He; Program: 60C(2min) => 5C/min => 160C(1min) => 10C/min => 250C (3min) |
Capillary | Methyl Silicone | 1295. | Couladis, Özcan, et al., 2004 | Program: not specified |
Capillary | 1276. | El-Shazily, Hafez, et al., 2004 | Program: not specified | |
Capillary | OV-1 | 1275. | El-Shazly and Hussein, 2004 | He; Column length: 15. m; Column diameter: 0.317 mm; Program: 50C(4min) => 4C/min => 90C => 10C/min => 300C(10min) |
Capillary | CP Sil 8 CB | 1298. | Mockutë, Bernotienë, et al., 2004 | He; Column length: 50. m; Column diameter: 0.32 mm; Program: 50 0C (2 min) 3 0C/min -> 180 0C (1 min) 20 0C/min -> 250 0C (2 min) |
Capillary | CP Sil 8 CB | 1298. | Mockutë, Judbentienë, et al., 2004 | 50. m/0.32 mm/0.25 μm, He; Program: 50C(2min) => 3C/min => 180C(1min) => 20C/min => 250C (2min) |
Capillary | HP-5MS | 1299. | Sahin, Gulluce, et al., 2004 | 30. m/0.25 mm/0.25 μm, He; Program: 50C(3min) => 3C/min => 150C(10min) => 10C/min => 250C |
Capillary | HP-5 | 1299. | Senatore, Apostolides Arnold, et al., 2004 | 30. m/0.25 mm/0.25 μm; Program: 40C(5min) => 2C/min => 250C(15min) => 10C/min => 270C |
Capillary | HP-5MS | 1298. | Singh, Maurya, et al., 2004 | 30. m/0.25 mm/0.25 μm, He; Program: 60C(1min) => 0.5C/min => 85C(1min) => 1C/min => 105C (2min) => 10C/min => 275C(2min) |
Capillary | HP-5 | 1314. | Sotomayor, Martínez, et al., 2004 | 30. m/0.25 mm/0.25 μm, He; Program: 60C(4min) => 1C/min => 64C => 2.5C/min => 155C => 5C/min => 250C |
Capillary | DB-5 | 1298. | Vilaseca, Guy, et al., 2004 | Program: not specified |
Capillary | SE-30 | 1278. | Vinogradov, 2004 | Program: not specified |
Capillary | HP-5 | 1299. | Güllüce, Sökmen, et al., 2003 | 30. m/0.25 mm/0.25 μm, He; Program: 50C(3min) => 3C/min => 150C(10min) => 10 C/min => 250C |
Capillary | HP-5 | 1314. | Jordán, Martínez, et al., 2003 | 30. m/0.25 mm/0.25 μm, He; Program: 60C (4min) => 1C/min => 64C => 2.5C/min => 155C => 5C/min => 250C |
Capillary | CP Sil 8 CB | 1298. | Mockute, Nivinskiene, et al., 2003 | 50. m/0.32 mm/0.25 μm, He; Program: 60C(1min) => 5C/min => 160C => 10C/min => 250C(5min) |
Capillary | AT-5 | 1297. | Usai, Atzei, et al., 2003 | 60. m/0.25 mm/0.25 μm, He; Program: 50 0C 5 0C/min -> 135 0C (1 min) 5 0C/min -> 225 0C (5 min) 5 0C/min -> 260 0C |
Capillary | AT-5 | 1289. | Usai, Atzei, et al., 2003 | 60. m/0.25 mm/0.25 μm, He; Program: 50 0C 5 0C/min -> 135 0C (1 min) 5 0C/min -> 225 0C (5 min) 5 0C/min -> 260 0C |
Capillary | DB-5 | 1299.5 | Veres, Varga, et al., 2003 | 30. m/0.25 mm/0.25 μm, He; Program: 60C => 3C/min => 210C => 5C/min => 250C(2min) |
Capillary | DB-5 | 1299. | Morteza-Semnani and Vahedi, 2002 | Program: not specified |
Capillary | HP-5 | 1300. | Singh, Singh, et al., 2002 | N2; Column length: 30. m; Column diameter: 0.32 mm; Program: 60 C (5 min) 1 C/min -> 140 C 10 C/min -> 270 C (5 min) |
Capillary | OV-101 | 1278. | Yang, 2001 | N2; Column length: 50. m; Column diameter: 0.25 mm; Program: not specified |
Capillary | CBP-1 | 1297. | Juliani, Biurrun, et al., 2000 | Program: not specified |
Capillary | DB-1 | 1286. | da Silva, Pedro, et al., 2000 | 30. m/0.25 mm/0.25 μm, H2; Program: 40 0C 3 K/min -> 175 0C 15 K/min -> 240 0C (10 min) |
Capillary | DB-1 | 1286. | Pedro, da Silva, et al., 1999 | 30. m/0.25 mm/0.25 μm, He; Program: 45C => 3C/min => 170C => 15C/min => 300C(10min) |
Capillary | CP Sil 5 CB | 1278. | Weyerstahl, Marschall, et al., 1999, 2 | Column length: 25. m; Column diameter: 0.39 mm; Program: not specified |
Capillary | CP Sil 5 CB | 1271. | Guyot, Bouseta, et al., 1998 | 50. m/0.32 mm/1.2 μm, He; Program: 30C => 55C/min => 85C => 1C/min => 145C => 3C/min => 250C |
Capillary | OV-1 | 1282. | Kökdil, 1998 | 50. m/0.32 mm/0.25 μm, He; Program: 1)50C(1min) => 4C/min => 180C => 2C/min => 250C(10min) 2)50C(1min) => 6C/min => 200C => 12C/min => 250C(5min) |
Capillary | DB-5 | 1313. | Sanda, Koba, et al., 1998 | 30. m/0.25 mm/0.25 μm, N2; Program: 45C(5min) => 2C/min => 200C => 5C/min => 250C |
Capillary | CP Sil 5 CB | 1275. | Weyerstahl, Marschall, et al., 1998 | He; Column length: 25. m; Phase thickness: 0.39 μm; Program: not specified |
Capillary | CP Sil 5 CB | 1277. | Weyerstahl, Marschall, et al., 1998, 2 | N2; Column length: 25. m; Phase thickness: 0.39 μm; Program: not specified |
Capillary | DB-5 | 1302. | Yusuf, Begum, et al., 1998 | 30. m/0.25 mm/0.25 μm, He; Program: 60C => 3C/min => 240C => 30C/min => 300C |
Capillary | DB-5 | 1299. | Anitescu, Doneanu, et al., 1997 | 15. m/0.25 mm/0.25 μm, He; Program: 40C(5min) => 5C/min => 120C(10min) => 4C/min => 250C(4min) => 5C/min => 280C |
Capillary | Polydimethyl siloxanes | 1284. | Zenkevich, 1997 | Program: not specified |
Capillary | 5 % Phenyl methyl siloxane | 1295. | Sagrero-Nieves and Bartley, 1995 | Program: not specified |
Capillary | OV-101 | 1297. | Shibamoto, 1987 | Program: not specified |

Normal alkane RI, polar column, temperature ramp

Column type | Active phase | I | Reference | Comment |
---|---|---|---|---|
Capillary | RTX-Wax | 2224. | Bendiabdellah, El Amine Dib, et al., 2012 | 60. m/0.22 mm/0.25 μm, Helium, 2. K/min, 230. C @ 5. min; Tstart: 60. C |
Capillary | TC-Wax | 2222. | Miyazawa, Fujita, et al., 2010 | Helium, 40. C @ 3. min, 3. K/min; Column length: 60. m; Column diameter: 0.25 mm; Tend: 230. C |
Capillary | Supelcowax 10 | 2229. | Koba, Catherine, et al., 2009 | 30. m/0.25 mm/0.25 μm, Helium, 5. K/min; Tstart: 50. C; Tend: 200. C |
Capillary | Innowax | 2235. | Seo, Kim, et al., 2009 | 30. m/0.25 mm/0.25 μm, Helium, 40. C @ 1. min, 6. K/min, 250. C @ 4. min |
Capillary | HP-Innowax | 2201. | Soria, Sanz, et al., 2008 | 50. m/0.20 mm/0.20 μm, Helium, 45. C @ 2. min, 4. K/min, 190. C @ 50. min |
Capillary | HP-Innowax | 2239. | Formisano, Rigano, et al., 2007 | 30. m/0.25 mm/0.25 μm, Helium, 40. C @ 5. min, 2. K/min; Tend: 250. C |
Capillary | HP-Innowax | 2201. | Hachicha, Skanji, et al., 2007 | 30. m/0.25 mm/0.25 μm, He, 2. K/min, 240. C @ 20. min; Tstart: 60. C |
Capillary | Innowax | 2239. | Abdelwahed, Hayder, et al., 2006 | 30. m/0.25 mm/0.25 μm, N2, 50. C @ 3. min, 9. K/min, 280. C @ 3. min |
Capillary | Innowax | 2239. | Abdelwahed, Hayder, et al., 2006 | 30. m/0.25 mm/0.25 μm, N2, 50. C @ 3. min, 9. K/min, 280. C @ 3. min |
Capillary | BP-20 | 2212. | Boti, Yao, et al., 2006 | 50. m/0.22 mm/0.25 μm, 2. K/min, 220. C @ 20. min; Tstart: 60. C |
Capillary | CP-Wax 52CB | 2233. | Hymete, Rohloff, et al., 2006 | 30. m/0.32 mm/0.25 μm, He, 60. C @ 7. min, 3.3 K/min, 220. C @ 3. min |
Capillary | HP-Wax | 2221. | Marzouk, Mansour, et al., 2006 | 30. m/0.25 mm/0.25 μm, Nitrogen, 5. K/min, 280. C @ 5. min; Tstart: 50. C |
Capillary | HP-20M | 2221. | Marzouk, Neffati, et al., 2006 | 30. m/0.25 mm/0.25 μm, N2, 5. K/min, 250. C @ 10. min; Tstart: 50. C |
Capillary | NB-20M | 2220. | Orav, Raal, et al., 2006 | 30. m/0.2 mm/0.25 μm, He, 2. K/min; Tstart: 50. C; Tend: 250. C |
Capillary | Innowax | 2190. | Bendimerad and Bendiab, 2005 | 50. m/0.2 mm/0.5 μm, He, 2. K/min, 250. C @ 60. min; Tstart: 60. C |
Capillary | Carbowax 20M | 2189. | de la Fuente, Martinez-Castro, et al., 2005 | 50. m/0.25 mm/0.25 μm, Helium, 40. C @ 2. min, 4. K/min, 190. C @ 30. min |
Capillary | DB-Wax | 2206. | Lee, Umano, et al., 2005 | 30. m/0.25 mm/0.25 μm, He, 3. K/min, 180. C @ 40. min; Tstart: 50. C |
Capillary | BP-20 | 2210. | Blanc, Muselli, et al., 2004 | 50. m/0.22 mm/0.25 μm, 2. K/min, 220. C @ 20. min; Tstart: 60. C |
Capillary | DB-Wax | 2227. | Choi, 2004 | 60. m/0.25 mm/0.25 μm, N2, 70. C @ 2. min, 2. K/min, 230. C @ 20. min |
Capillary | Innowax FSC | 2239. | Lourens, Reddy, et al., 2004 | Helium, 60. C @ 10. min, 4. K/min; Column length: 60. m; Column diameter: 0.25 mm; Tend: 220. C |
Capillary | DB-Wax | 2220. | Palá-Paúl, Brophy, et al., 2004 | 60. m/0.32 mm/0.25 μm, He, 3. K/min; Tstart: 35. C; Tend: 220. C |
Capillary | HP-Innowax | 2236. | Soria, Gonzalez, et al., 2004 | 50. m/0.2 mm/0.2 μm, He, 45. C @ 2. min, 4. K/min, 190. C @ 50. min |
Capillary | DB-Wax | 2215. | Mookdasanit, Tamura, et al., 2003 | Helium, 2. K/min, 210. C @ 60. min; Column length: 60. m; Column diameter: 0.25 mm; Tstart: 70. C |
Capillary | Innowax | 2239. | Suleimenov, Atazharova, et al., 2003 | He, 60. C @ 10. min, 4. K/min, 220. C @ 10. min; Column length: 60. m; Column diameter: 0.25 mm |
Capillary | PEG-20M | 2186. | Orav and Kann, 2001 | He, 2. K/min; Column length: 50. m; Column diameter: 0.2 mm; Tstart: 70. C; Tend: 220. C |
Capillary | Innowax | 2239. | Baser, Özek, et al., 2000 | 60. m/0.25 mm/0.25 μm, He, 60. C @ 10. min, 4. K/min, 220. C @ 10. min |
Capillary | Innowax | 2240. | Baser, Özek, et al., 2000 | 60. m/0.25 mm/0.25 μm, He, 60. C @ 10. min, 4. K/min, 220. C @ 10. min |
Capillary | DB-Wax | 2217. | Tamura, Boonbumrung, et al., 2000 | Nitrogen, 40. C @ 10. min, 2. K/min; Column length: 60. m; Column diameter: 0.25 mm; Tend: 200. C |
Capillary | DB-Wax | 2210. | Umano, Hagi, et al., 2000 | 60. m/0.25 mm/0.25 μm, He, 40. C @ 2. min, 2. K/min; Tend: 200. C |
Capillary | HP Innowax FSP | 2246. | Kaya, Baser, et al., 1999 | 60. m/0.25 mm/0.25 μm, He, 60. C @ 10. min, 220. C @ 10. min |
Capillary | Innowax | 2246. | Kaya, Baser, et al., 1999, 2 | 60. m/0.25 mm/0.25 μm, He, 60. C @ 10. min; Tend: 220. C |
Capillary | HP-Innowax | 2246. | Kaya, Baser, et al., 1999, 3 | 60. m/0.25 mm/0.25 μm, He, 60. C @ 10. min; Tend: 220. C |
Capillary | FFAP | 2235. | Mockute and Bernotiene, 1999 | He, 70. C @ 10. min, 3. K/min; Column length: 25. m; Column diameter: 0.2 mm; Tend: 210. C |
Capillary | DB-Wax | 2229. | Weyerstahl, Marschall, et al., 1999 | N2, 5. K/min; Column length: 60. m; Phase thickness: 0.25 μm; Tstart: 60. C; Tend: 220. C |
Capillary | Supelcowax | 2205. | Näf and Velluz, 1998 | He, 5. K/min; Column length: 60. m; Column diameter: 0.25 mm; Tstart: 80. C; Tend: 240. C |
Capillary | HP-Innowax FSC | 2246. | Tümen, Baser, et al., 1998 | 60. m/0.25 mm/0.25 μm, He, 60. C @ 10. min, 4. K/min, 220. C @ 10. min |
Capillary | DB-Wax | 2223. | Werkhoff, Güntert, et al., 1998 | 60. m/0.32 mm/0.25 μm, H2, 3. K/min; Tstart: 60. C; Tend: 220. C |
Capillary | HP-Innowax FSC | 2246. | Baser, Kirimer, et al., 1997 | He, 60. C @ 10. min, 4. K/min, 240. C @ 10. min; Column length: 60. m; Column diameter: 0.25 mm |
Capillary | TC-Wax | 2229. | Shuichi, Masazumi, et al., 1996 | 80. C @ 5. min, 3. K/min; Column length: 60. m; Column diameter: 0.25 mm; Tend: 240. C |
Capillary | DB-Wax | 2177. | Stashenko, Puertas, et al., 1996 | 60. m/0.25 mm/0.25 μm, He, 50. C @ 5. min, 2.5 K/min; Tend: 180. C |
Capillary | Carbowax 20M | 2199. | Kollmannsberger, Nitz, et al., 1992 | 45. m/0.32 mm/1.0 μm, Hydrogen, 60. C @ 5. min, 2. K/min; Tend: 200. C |
Capillary | DB-Wax | 2240. | Wyllie, Brophy, et al., 1990 | 70. C @ 2. min, 4. K/min; Column length: 30. m; Column diameter: 0.32 mm; Tend: 200. C |
Capillary | Carbowax 20M | 2200. | Nykanen, 1986 | 40. C @ 5. min, 2. K/min; Column length: 25. m; Column diameter: 0.30 mm; Tend: 220. C |
Packed | Carbowax 20M | 2181. | Stancher and Pertoldi, 1967 | Hydrogen, Gas-Chrom Z (80-100 mesh), 4. K/min; Column length: 2. m; Tstart: 65. C; Tend: 220. C |

Normal alkane RI, polar column, custom temperature program

Column type | Active phase | I | Reference | Comment |
---|---|---|---|---|
Capillary | Innowax FSC | 2239. | Bardakci, Demirci, et al., 2012 | 60. m/0.25 mm/0.25 μm, Helium; Program: 60 0C (10 min) 4 0C/min -> 220 0C 1 0C/min -> 240 0C |
Capillary | Innowax FSC | 2239. | Demirci, Temel, et al., 2011 | 60. m/0.25 mm/0.25 μm, Helium; Program: 60 0C (10 min) 4 0C/min -> 220 0C (10 min) 1 0C/min -> 240 0C |
Capillary | HP Innowax | 2215. | Laribi, Kouki, et al., 2011 | 30. m/0.25 mm/0.25 μm, Nitrogen; Program: 35 0C (10 min) 3 0C/min -> 205 0C 10 0C/min -> 225 0C |
Capillary | Innowax | 2239. | Noorizadeh, Farmany, et al., 2011 | 60. m/0.25 mm/0.33 μm; Program: not specified |
Capillary | HP Innowax | 2239. | Noorizadeh and Farmany, 2010 | 60. m/0.25 mm/0.33 μm; Program: not specified |
Capillary | Innowax FSC | 2239. | Baser, Demirci, et al., 2009 | 60. m/0.25 mm/0.25 μm, Helium; Program: 60 0C (10 min) 4 0C/min -> 220 0C (10 min) 1 0C/min -> 240 0C |
Capillary | DB-Wax | 2187. | Keefover-Ring, Thompson, et al., 2009 | 15. m/0.25 mm/0.25 μm, Helium; Program: 50 0C (5 min) 6 0C/min -> 125 0C 10 0C/min -> 170 0C |
Capillary | DB-Wax | 2192. | Keefover-Ring, Thompson, et al., 2009 | 15. m/0.25 mm/0.25 μm, Helium; Program: 50 0C (5 min) 6 0C/min -> 125 0C 10 0C/min -> 170 0C |
Capillary | HP Innowax | 2239. | Mancini, Arnold, et al., 2009 | 50. m/0.20 mm/0.25 μm, Helium; Program: 40 0C (5 min) 2 0C/min -> 270 0C -> 260 0C (20 min) |
Capillary | HP-Innowax FSC | 2239. | Baser K.H.C. and Demirci B., 2007 | 60. m/0.25 mm/0.25 μm, N2; Program: 60C(10min) => 4C/min => 220C(10min) => 1C/min => 240C |
Capillary | HP-Innowax | 2239. | Formisano, Mignola, et al., 2007 | 50. m/0.2 mm/0.2 μm, He; Program: 40C(5min) => 2C/min => 250C(15min) => 10C/min => 270C |
Capillary | Innowax FSC | 2239. | Kaya, Benirci, et al., 2007 | 60. m/0.25 mm/0.25 μm, Nitrogen; Program: 60 0C (10 min) 1 0C/min -> 220 0C (10 min) 1 0C/min -> 240 0C |
Capillary | HP-Innowax FSC | 2239. | Tabanca N., Demirci B., et al., 2007 | 60. m/0.25 mm/0.25 μm, He; Program: 60C(10min) => 4C/min => 220C(10min) => 1C/min => 240C |
Capillary | Innowax FSC | 2239. | Tabanca, Demirci, et al., 2007 | 60. m/0.25 mm/0.25 μm, He; Program: 60C(10min) => 4C/min => 220C (10min) => 1C/min => 240C |
Capillary | HP Innowax FSP | 2239. | Tabanca N., Demirci B., et al., 2007, 2 | 60. m/0.25 mm/0.25 μm, N2; Program: 60C(10min) => 4C/min => 220C(10min) => 1C/min => 240C |
Capillary | Innowax FSC | 2239. | Baser K.H.C., Ozek G., et al., 2006 | 60. m/0.25 mm/0.25 μm, He; Program: 60C(10min) => 4C/min => 220C (10min) => 1C/min => 240C |
Capillary | HP-Innowax FSC | 2239. | Demirci B., Baser K.H.C., et al., 2006 | 60. m/0.25 mm/0.25 μm, N2; Program: 60C(10min) => 4C/min => 220C(10min) => 1C/min => 240C |
Capillary | HP-Innowax FSC | 2239. | Erdurak, Coskun, et al., 2006 | 60. m/0.25 mm/0.25 μm, He; Program: 60C(10min) => 4C/min => 220C (10min) => 1C/min => 240C |
Capillary | HP-Innowax FSC | 2239. | Kürkçüoglu, Hüsnü Can Baser, et al., 2006 | 60. m/0.25 mm/0.25 μm, He; Program: 60C(10min) => 4C/min => 220C (10min) => 1C/min => 240C |
Capillary | HP-Innowax FSC | 2239. | Suleimenov Y.M., Atazhanova G.A., et al., 2006 | 60. m/0.25 mm/0.25 μm, He; Program: 60(10min) => 4C/min => 220C(10min) => 1C/min => 240C |
Capillary | HP-Innowax FSC | 2181. | Suleimenov Y.M., Atazhanova G.A., et al., 2006 | 60. m/0.25 mm/0.25 μm, He; Program: 60(10min) => 4C/min => 220C(10min) => 1C/min => 240C |
Capillary | HP-Innowax FSC | 2239. | Tabanca, Demirci, et al., 2006 | 60. m/0.25 mm/0.25 μm; Program: 60C(10min) => 4C/min => 220C (10min) => 1C/min => 240C |
Capillary | HP-Innowax FSC | 2239. | Tabanca, Demirci, et al., 2006, 2 | 60. m/0.25 mm/0.25 μm, N2; Program: 60C(10min) => 4C/min => 220C => (10min) => 1C/min => 240C |
Capillary | Innowax FSC | 2239. | Tosun, Kürkcüoglu, et al., 2006 | 60. m/0.25 mm/0.25 μm, He; Program: 60C(10min) => 4C/min => 220C (10min) => 1C/min => 240C |
Capillary | HP-Innowax FSC | 2239. | Demirci, Demirci, et al., 2005 | 60. m/0.25 mm/0.25 μm, N2; Program: 60C(10min) => 4C/min => 220C (10min) => 1C/min => 240C |
Capillary | HP-Innowax | 2239. | Duman, Kartal, et al., 2005 | 60. m/0.25 mm/0.25 μm, N2; Program: 60C(10min) => 4C/min => 220C(10min) => 1C/min => 240C |
Capillary | HP-Innowax FSC | 2246. | Sezik E., Kocakulak E., et al., 2005 | 60. m/0.25 mm/0.25 μm, He; Program: 60C(10min) => 4C/min => 220C(10min) => 1C/min => 240C |
Capillary | HP-Innowax FSC | 2239. | Tabanca, Demirci, et al., 2005 | 60. m/0.25 mm/0.25 μm, He; Program: 60C(10min) => 4C/min => 220C(10min) => 1C/min => 240C |
Capillary | Innowax FSC | 2246. | Baser, Özek, et al., 2004 | 60. m/0.25 mm/0.25 μm, He; Program: 60C(10min) => 4C/min => 220C(10min) => 1C/min => 240C |
Capillary | Innowax FSC | 2181. | Baser, Özek, et al., 2004 | 60. m/0.25 mm/0.25 μm, He; Program: 60C(10min) => 4C/min => 220C(10min) => 1C/min => 240C |
Capillary | HP-Innowax FSC | 2181. | Demirci, Paper, et al., 2004 | 60. m/0.25 mm/0.25 μm, He; Program: 60C(10min) => 4C/min => 220C(10min) => 1C/min => 240C |
Capillary | HP-Innowax FSC | 2239. | Demirci, Paper, et al., 2004 | 60. m/0.25 mm/0.25 μm, He; Program: 60C(10min) => 4C/min => 220C(10min) => 1C/min => 240C |
Capillary | HP-Innowax FSC | 2239. | Kivcak, Akay, et al., 2004 | 60. m/0.25 mm/0.25 μm, He; Program: 60C(10min) => 4C/min => 220C(10min) => 1C/min => 240C |
Capillary | HP-Innowax | 2239. | Senatore, Apostolides Arnold, et al., 2004 | 50. m/0.2 mm/0.2 μm; Program: not specified |
Capillary | Carbowax 20M | 2181. | Vinogradov, 2004 | Program: not specified |
Capillary | Innowax FSC | 2239. | Baser, Demirci, et al., 2003 | 60. m/0.25 mm/0.25 μm, He; Program: 60C(10min) => 4C/min => 220C (10min) => 1C/min => 240C |
Capillary | HP-Innowax FSC | 2239. | Demirci, Baser, et al., 2003 | 60. m/0.25 mm/0.25 μm, He; Program: 60C (10min) => 4C/min => 220C (10min) => 1C/min => 240C |
Capillary | Innowax FSC | 2239. | Demirci and Baser, 2003 | 60. m/0.25 mm/0.25 μm, He; Program: 60C (10min) => 4C/min => 220C (10min) => 1C/min => 240C |
Capillary | HP-Innowax FSC | 2239. | Demirci, Dadandi, et al., 2003 | 60. m/0.25 mm/0.25 μm, He; Program: 60C(10min) => 4C/min => 220C(10min) => 1C/min => 240C |
Capillary | HP-Innowax FSC | 2239. | Demirci, Demirci, et al., 2003 | 60. m/0.25 mm/0.25 μm, He; Program: 60C(10min) => 4C/min => 220C(10min) => 1C/min => 240C |
Capillary | HP-Innowax FSC | 2239. | Kaya, Demirci, et al., 2003 | 60. m/0.25 mm/0.25 μm, N2; Program: 60C(10min) => 4C/min => 220C(10min) => 1C/min => 240C |
Capillary | HP-Innowax FSC | 2239. | Kürkcüoglu, Demirci, et al., 2003 | 60. m/0.25 mm/0.25 μm, He; Program: 60C(10min) => 4C/min => 220C(10min) => 1C/min => 240C(40min) |
Capillary | HP-Innowax | 2221. | Piasenzotto, Gracco, et al., 2003 | 30. m/0.32 mm/0.5 μm, He; Program: 50C(4min) => 10C/min => 230C(10min) => 10C/min => 250C |
Capillary | Innowax | 2239. | Tunaher, Kirimer, et al., 2003 | 60. m/0.25 mm/0.25 μm, He; Program: 60C(10min) => 4C/min => 220C(10min) => 1C/min => 240C (20min) |
Capillary | HP-Innowax | 2239. | Baser, Demirci, et al., 2002 | 60. m/0.25 mm/0.25 μm, He; Program: 60 0C (10 min) 4 K/min -> 220 0C (10 min) 1 K/min -> 240 0C |
Capillary | HP-Innowax | 2181. | Baser, Demirci, et al., 2002 | 60. m/0.25 mm/0.25 μm, He; Program: 60 0C (10 min) 4 K/min -> 220 0C (10 min) 1 K/min -> 240 0C |
Capillary | Innowax FSC | 2239. | Baser, Demirei, et al., 2002 | 60. m/0.25 mm/0.25 μm, He; Program: 60C(10min) => 4C/min => 220C(10min) => 1C/min => 240C |
Capillary | Innowax | 2239. | Baser, Nuriddinov, et al., 2002 | 60. m/0.25 mm/0.25 μm, He; Program: 60C(10min) => 4C/min => 220C(10min) => 1C/min => 240C |
Capillary | HP-Innowax | 2239. | Demirci, Baser, et al., 2002 | 60. m/0.25 mm/0.25 μm, He; Program: 60 0C (10 min) 4 K/min -> 220 0C (10 min) 1 K/min -> 240 0C |
Capillary | HP-Innowax FSC | 2239. | Hüsnü Can Baser, Demirci, et al., 2002 | 60. m/0.25 mm/0.25 μm, N2; Program: 60C(10min) => 4C/min => 220C(10min) => 1C/min => 240C |
Capillary | Innowax FSC | 2246. | Tunalier, Kirimer, et al., 2002 | 60. m/0.25 mm/0.25 μm; Program: 60C(10min) => 4C/min => 220C(10min) => 1C/min => 240C |
Capillary | HP-Innowax | 2239. | Baser, Demirci, et al., 2001 | 60. m/0.25 mm/0.25 μm, He; Program: 60 0C (10 min) 10 K/min -> 220 0C (10 min) 1K/min -> 240 0C |
Capillary | HP-Innowax | 2239. | Gören, Demirci, et al., 2001 | 60. m/0.25 mm/0.25 μm, He; Program: 60 0C (10 min) 4 K/min -> 220 0C (10 min) 1 K/min -> 240 0C |
Capillary | HP-Innowax FSC | 2239. | Kaya, Demirci, et al., 2001 | 60. m/0.25 mm/0.25 μm; Program: 60C(10min) => 4C/min => 220C(10min) => 1C/min => 240C |
Capillary | HP-Innowax FSC | 2239. | Kirimer N., Tabanea N., et al., 2001 | 60. m/0.25 mm/0.25 μm, He; Program: 60C(10min) => 4C/min => 220C(10min) => 1C/min => 240C |
Capillary | Nukol | 2189. | López and Dufour, 2001 | N2; Column length: 25. m; Column diameter: 0.25 mm; Program: 45C(5min) => 20C/min => 100C(1min) => 3C/min => 190C(40min) |
Capillary | Innowax | 2240. | Özcan, Akgül, et al., 2001 | 60. m/0.25 mm/0.25 μm, He; Program: 60C(10min) => 4C/min => 200C(10min) => 1C/min => 240C |
Capillary | Innowax FSC | 2239. | Tabanca N., Demirci F., et al., 2001 | 60. m/0.25 mm/0.25 μm, He; Program: 60C(10min) => 4C/min => 220C(10min) => 1C/min => 240C |
Capillary | HP-Innowax FSC | 2246. | Tabanca, Kirimer, et al., 2001 | 60. m/0.25 mm/0.25 μm; Program: 60C(10min) => 4C/min => 220C(10min) => 1C/min => 240C |
Capillary | HP-Innowax | 2239. | Tabanca, Kirimer, et al., 2001, 2 | 60. m/0.25 mm/0.25 μm, He; Program: 60C(10min) => 4C/min => 220C(10min) => 1C/min => 240C |
Capillary | Innowax | 2240. | Baser, Özek, et al., 2000, 2 | 60. m/0.25 mm/0.25 μm, He; Program: 60 0C (10 min) 4 K/min -> 220 0C (10 min) 1 K/min -> 240 0C |
Capillary | Innowax | 2240. | Baser, Özek, et al., 2000, 3 | 60. m/0.25 mm/0.25 μm, He; Program: 60 0C (10 min) 4 K/min -> 220 0C (10 min) 1 K/min -> 240 0C |
Capillary | Innowax | 2240. | Baser, Tabanca, et al., 2000 | 60. m/0.25 mm/0.25 μm, He; Program: 60 0C (10 min) 4 K/min -> 220 0C (10 min) 1 K/min -> 240 0C |
Capillary | Supelcowax-10 | 2194. | Juliani, Biurrun, et al., 2000 | Program: not specified |
Capillary | Innowax FSC | 2246. | Kirimer, Tabanca, et al., 2000 | 60. m/0.25 mm/0.25 μm, He; Program: 60C(10 min) => 4C/min => 220C(10min) => 1C/min => 240C |
Capillary | Innowax FSC | 2246. | Kirimer, Tabanca, et al., 1999 | 60. m/0.25 mm/0.25 μm, Helium; Program: 60 0C (10 min) 4 0C/min -> 220 0C (10 min) 1 0C/min -> 240 0C |
Capillary | Innowax | 2246. | Baser, Kürkcüoglu, et al., 1998 | 60. m/0.25 mm/0.25 μm; Program: 60C(10min) => 4C/min => 220C(10min) => 1C/min => 240C |
Capillary | FFAP | 2211. | Reddy, Angers, et al., 1998 | 25. m/0.2 mm/0.33 μm, H2; Program: 40C(5min) => 4C/min => 170C => 8C/min => 240C (12min) |
Capillary | DB-Wax | 2222. | Weyerstahl, Marschall, et al., 1998 | N2; Column length: 60. m; Phase thickness: 0.25 μm; Program: not specified |
Capillary | DB-Wax | 2224. | Weyerstahl, Marschall, et al., 1998, 2 | N2; Column length: 60. m; Phase thickness: 0.25 μm; Program: not specified |
Capillary | NB-351 | 2222. | Kerrola and Kallio, 1993 | 25. m/0.32 mm/0.2 μm; Program: 40C(5min) => 4C/min => 150C => 8C/min => 240C(12min) |
Capillary | DB-Wax | 2173. | Hatsuko, Kazuko, et al., 1992 | He; Column length: 30. m; Column diameter: 0.25 mm; Program: not specified |

References

Bertholon, Giray, et al., 1971
Bertholon, G.; Giray, M.; Perrin, R.; Vincent-Falquet-Berny, M.F.,
No. 532. - Etude physicochimique des phenols. OX. - Ethanlpies de combustion et energies de resonance des alcoyl et aryphenols,
Bull. Soc. Chim. France, 1971, 3180-3187. [all data]
Lamartine and Perrin, 1969
Lamartine, R.; Perrin, R.,
Etude physiocochimique des phenols. VIII. Caracterisation physicochimique des methyl-2 isopropylphenols ou carvacrols,
Bull. Soc. Chim. France, 1969, 10, 443-445. [all data]
Karr, 1957
Karr, C.,
, U. S. Bur. Mines, Inform. Circ. IC 7802, 1957. [all data]
Carpenter and Easter, 1955
Carpenter; Easter,
J. Org. Chem., 1955, 20, 401. [all data]
Gardner, Procofief, et al., 1935
Gardner; Procofief; Jusov; Casselli,
C. R. Hebd. Seances Acad. Sci., 1935, 200, 1114. [all data]
van Roon, Parsons, et al., 2002
van Roon, André; Parsons, John R.; Govers, Harrie A.J.,
Gas chromatographic determination of vapour pressure and related thermodynamic properties of monoterpenes and biogenically related compounds,
Journal of Chromatography A, 2002, 955, 1, 105-115, https://doi.org/10.1016/S0021-9673(02)00200-5
. [all data]
Stephenson and Malanowski, 1987
Stephenson, Richard M.; Malanowski, Stanislaw,
Handbook of the Thermodynamics of Organic Compounds, 1987, https://doi.org/10.1007/978-94-009-3173-2
. [all data]
Stull, 1947
Stull, Daniel R.,
Vapor Pressure of Pure Substances. Organic and Inorganic Compounds,
Ind. Eng. Chem., 1947, 39, 4, 517-540, https://doi.org/10.1021/ie50448a022
. [all data]
Lamartine and Perrin, 1969, 2
Lamartine, R.; Perrin, R.,
Bull. Soc. Chim. Fr., 1969, 2, 443. [all data]