Carvenone
- Formula: C10H16O
- Molecular weight: 152.2334
- IUPAC Standard InChIKey: RLYSXAZAJUMULG-UHFFFAOYSA-N
- CAS Registry Number: 499-74-1
- Chemical structure:
View 3d structure (requires JavaScript / HTML 5) - Other names: 2-Cyclohexen-1-one, 6-methyl-3-(1-methylethyl)-; p-Menth-3-en-2-one; p-3-menthen-2-one (carvenone); 3-(isopropyl)-6-methylcyclohex-2-en-1-one

Condensed phase thermochemistry data

Data compiled by: Hussein Y. Afeefy, Joel F. Liebman, and Stephen E. Stein
Quantity | Value | Units | Method | Reference | Comment |
---|---|---|---|---|---|
ΔcH°liquid | -1409.1 | kcal/mol | Ccb | Roth-Greifswald, 1911 | Heat of combustion corrected for pressure; Corresponding ΔfHºliquid = -77.9 kcal/mol (simple calculation by NIST; no Washburn corrections) |

Normal alkane RI, non-polar column, custom temperature program

Data compiled by: NIST Mass Spectrometry Data Center, William E. Wallace, director

Column type CapillaryCapillaryCapillaryCapillaryCapillary
Active phase HP-5 MSSE-52SE-30OV-1CP Sil 5 CB
Column length (m) 30.30. 50.25.
Carrier gas HeliumHe HeHe
Substrate
Column diameter (mm) 0.250.32 0.32
Phase thickness (μm) 0.250.15 0.250.39
Program 40 0C (5 min) 6 0C -> 120 0C (5 min) 8 0C/min -> 300 0C45C => 1C/min => 100C => 5C/min => 250C (10min)not specified1)50C(1min) => 4C/min => 180C => 2C/min => 250C(10min) 2)50C(1min) => 6C/min => 200C => 12C/min => 250C(5min)not specified
I 1262.1258.1250.1208.1227.
ReferenceAttia, Grissa, et al., 2012Tognolini, Barocelli, et al., 2006Vinogradov, 2004Kökdil, 1998Weyerstahl, Marschall, et al., 1998
Comment MSDC-RI MSDC-RI MSDC-RI MSDC-RI MSDC-RI
Column type CapillaryCapillary
Active phase DB-5Polydimethyl siloxanes
Column length (m)
Carrier gas
Substrate
Column diameter (mm)
Phase thickness (μm)
Program not specifiednot specified
I 1252.1250.
ReferenceIsidorov, Zenkevich, et al., 1997Zenkevich, 1997
Comment MSDC-RI MSDC-RI

Kovats' RI, non-polar column, temperature ramp

Data compiled by: NIST Mass Spectrometry Data Center, William E. Wallace, director

Column type CapillaryCapillary
Active phase DB-5DB-5
Column length (m) 30.30.
Carrier gas  He
Substrate
Column diameter (mm) 0.250.26
Phase thickness (μm) 0.50.25
Tstart (C) 50.60.
Tend (C) 250.246.
Heat rate (K/min) 7.3.
Initial hold (min) 3.
Final hold (min) 10.
I 1253.1252.
ReferenceEl-Massry, El-Ghorab, et al., 2002Adams, 2000
Comment MSDC-RI MSDC-RI

Phase change data

Data compiled by: William E. Acree, Jr., James S. Chickos

Enthalpy of vaporization

ΔvapH (kJ/mol) Temperature (K) Method Reference Comment
56.9379.AStephenson and Malanowski, 1987Based on data from 364. - 507. K.

Kovats' RI, non-polar column, isothermal

Data compiled by: NIST Mass Spectrometry Data Center, William E. Wallace, director

Column type CapillaryCapillary
Active phase SE-30SE-30
Column length (m)  40.
Carrier gas
Substrate
Column diameter (mm)  0.35
Phase thickness (μm)  0.35
Temperature (C) 120.100.
I 1236.1236.2
ReferenceTudor and Moldovan, 1999Tudor, 1997
Comment MSDC-RI MSDC-RI

References

Roth-Greifswald, 1911
Roth-Greifswald, W.A.,
XVIII. Hauptversammlung der Deutschen Bunsen-Gesellschaft fur angewandte physikalische Chemie,
Z. Electrochem., 1911, 17, 789-840. [all data]