Benzoic acid, 3,5-dimethyl-
- Formula: C9H10O2
- Molecular weight: 150.1745
- IUPAC Standard InChIKey: UMVOQQDNEYOJOK-UHFFFAOYSA-N
- CAS Registry Number: 499-06-9
- Chemical structure:
View 3d structure (requires JavaScript / HTML 5) - Other names: Mesitylenic acid; 3,5-Dimethylbenzoic acid

Gas phase thermochemistry data

Data compiled as indicated in comments:
ALS - Hussein Y. Afeefy, Joel F. Liebman, and Stephen E. Stein
DRB - Donald R. Burgess, Jr.
Quantity | Value | Units | Method | Reference | Comment |
---|---|---|---|---|---|
ΔfH°gas | -364.5 ± 1.7 | kJ/mol | Ccb | Colomina, Jimenez, et al., 1984 | see Colomina, Perez-Ossorio, et al., 1961 and Colomina, Perez Ossorio, et al., 1959; ALS |
ΔfH°gas | -364.1 | kJ/mol | N/A | Corral, 1960 | Value computed using ΔfHsolid° value of -466.4±0.9 kj/mol from Corral, 1960 and ΔsubH° value of 102.3 kj/mol from Colomina, Jimenez, et al., 1984.; DRB |

Condensed phase thermochemistry data

Data compiled as indicated in comments:
ALS - Hussein Y. Afeefy, Joel F. Liebman, and Stephen E. Stein
DH - Eugene S. Domalski and Elizabeth D. Hearing
Quantity | Value | Units | Method | Reference | Comment |
---|---|---|---|---|---|
ΔfH°solid | -466.8 ± 1.7 | kJ/mol | Ccb | Colomina, Jimenez, et al., 1984 | see Colomina, Perez-Ossorio, et al., 1961 and Colomina, Perez Ossorio, et al., 1959; ALS |
ΔfH°solid | -466.43 ± 0.88 | kJ/mol | Ccb | Corral, 1960 | ALS |
Quantity | Value | Units | Method | Reference | Comment |
ΔcH°solid | -4504.0 ± 0.1 | kJ/mol | Ccb | Colomina, Jimenez, et al., 1984 | see Colomina, Perez-Ossorio, et al., 1961 and Colomina, Perez Ossorio, et al., 1959; Corresponding ΔfHºsolid = -466.77 kJ/mol (simple calculation by NIST; no Washburn corrections); ALS |
ΔcH°solid | -4504.37 ± 0.71 | kJ/mol | Ccb | Corral, 1960 | Corresponding ΔfHºsolid = -466.39 kJ/mol (simple calculation by NIST; no Washburn corrections); ALS |
Constant pressure heat capacity of solid
Cp,solid (J/mol*K) | Temperature (K) | Reference | Comment |
---|---|---|---|
192.2 | 299.15 | Colomina, Jimenez, et al., 1984 | DH |

Phase change data

Data compiled as indicated in comments:
ALS - Hussein Y. Afeefy, Joel F. Liebman, and Stephen E. Stein
DRB - Donald R. Burgess, Jr.
AC - William E. Acree, Jr., James S. Chickos
Quantity | Value | Units | Method | Reference | Comment |
---|---|---|---|---|---|
ΔsubH° | 102.3 ± 0.3 | kJ/mol | V | Colomina, Jimenez, et al., 1984 | see Colomina, Perez-Ossorio, et al., 1961 and Colomina, Perez Ossorio, et al., 1959; ALS |
ΔsubH° | 102.3 | kJ/mol | N/A | Colomina, Jimenez, et al., 1984 | DRB |
ΔsubH° | 102.3 ± 0.3 | kJ/mol | ME | Colomina, Jimenez, et al., 1984 | Based on data from 322. to 341. K.; AC |
Enthalpy of sublimation
ΔsubH (kJ/mol) | Temperature (K) | Method | Reference | Comment |
---|---|---|---|---|
100.8 ± 0.3 | 332. | ME | Colomina, Jimenez, et al., 1984 | Based on data from 322. to 341. K.; AC |
Enthalpy of fusion
ΔfusH (kJ/mol) | Temperature (K) | Reference | Comment |
---|---|---|---|
22.6 | 442.9 | Belhachemi, Ufnalsky, et al., 1996 | AC |

Reaction thermochemistry data

Data compiled by: John E. Bartmess
Individual Reactions
C9H9O2- + =
By formula: C9H9O2- + H+ = C9H10O2
Quantity | Value | Units | Method | Reference | Comment |
---|---|---|---|---|---|
ΔrH° | 1426. ± 9.2 | kJ/mol | G+TS | Decouzon, Exner, et al., 1996 | gas phase |
Quantity | Value | Units | Method | Reference | Comment |
ΔrG° | 1397. ± 8.4 | kJ/mol | IMRE | Decouzon, Exner, et al., 1996 | gas phase |

Gas phase ion energetics data

Data compiled by: John E. Bartmess
De-protonation reactions
C9H9O2- + =
By formula: C9H9O2- + H+ = C9H10O2
Quantity | Value | Units | Method | Reference | Comment |
---|---|---|---|---|---|
ΔrH° | 1426. ± 9.2 | kJ/mol | G+TS | Decouzon, Exner, et al., 1996 | gas phase |
Quantity | Value | Units | Method | Reference | Comment |
ΔrG° | 1397. ± 8.4 | kJ/mol | IMRE | Decouzon, Exner, et al., 1996 | gas phase |

References

Colomina, Jimenez, et al., 1984
Colomina, M.; Jimenez, P.; Roux, M.V.; Turrion, C.,
Thermochemical properties of benzoic acid derivatives. XI. Vapour pressures and enthalpies of sublimation and formation of the six dimethylbenzoic acids,
J. Chem. Thermodyn., 1984, 16, 1121-1127. [all data]
Colomina, Perez-Ossorio, et al., 1961
Colomina, M.; Perez-Ossorio, R.; Boned, M.L.; Panea, M.; Turrion, C.,
Investigaciones termoquimicas sobre los acidos alquilbenzoicos. II. Acidos dimetrilbenzoicos,
Anal. Fisc. Quim. B, 1961, 57, 665-672. [all data]
Colomina, Perez Ossorio, et al., 1959
Colomina, M.; Perez Ossorio, R.; Boned, M.L.; Panea, M.; Turrion, C.,
Thermochemical investigations on methylsubstituted benzoic acids, Rpt. for the U.S. Dept. of the Army, European Research Office contract no. DA-91-508-EUC-358 by Instituto de Quimica Fisica Madrid, Spain, 1959, 1-36. [all data]
Corral, 1960
Corral, L.B.,
Investigaciones termoquimicas sobre los acidos toluicos y dimetilbenzoicos,
Rev. R. Acad. Cienc., 1960, 54, 365-403. [all data]
Belhachemi, Ufnalsky, et al., 1996
Belhachemi, B.; Ufnalsky, W.; Derriche, Z.,
Determination of melting enthalpies and solubility curves in n-hexane of 2,3- and 3,5-dimethyl benzoic acids. Comparison with UNIFAC calculations,
J. Chim. Phys. Phys.-Chim. Biol., 1996, 93, 6, 1117. [all data]
Decouzon, Exner, et al., 1996
Decouzon, M.; Exner, O.; Gal, J.-F.; Maria, P.-C.,
Non-classical Buttressing Effect: Gas-phase Ionization of Some Methyl Substituted Benzoic Acids,
J. Chem. Soc. Perkin Trans., 1996, 2, 4, 475, https://doi.org/10.1039/p29960000475
. [all data]