Hydrazine, 1-methyl-1-propyl-
- Formula: C4H12N2
- Molecular weight: 88.1515
- IUPAC Standard InChIKey: JOFQXPUKJJQCPW-UHFFFAOYSA-N
- CAS Registry Number: 4986-49-6
- Chemical structure:
View 3d structure (requires JavaScript / HTML 5) - Other names: 1-Methyl-1-n-propylhydrazine

Normal alkane RI, non-polar column, temperature ramp

Column type | Active phase | I | Reference | Comment |
---|---|---|---|---|
Capillary | OV-101 | 701. | Zenkevich, 2005 | 25. m/0.20 mm/0.10 μm, N2/He, 6. K/min; Tstart: 50. C; Tend: 250. C |

References

Zenkevich, 2005
Zenkevich, I.G.,
Experimentally measured retention indices., 2005. [all data]