3,3,6,6-tetramethyloctanedioic acid anhydride
- Formula: C12H20O3
- Molecular weight: 212.2854
- IUPAC Standard InChIKey: JNRLZMHPADUYPV-UHFFFAOYSA-N
- CAS Registry Number: 49862-24-0
- Chemical structure:
View 3d structure (requires JavaScript / HTML 5) - Permanent link for this species. Use this link for bookmarking this species for future reference.

Phase change data

Data compiled by: Thermodynamics Research Center, NIST Boulder Laboratories, Chris Muzny director
Quantity | Value | Units | Method | Reference | Comment |
---|---|---|---|---|---|
Tfus | 344. | K | N/A | Borgen, 1974 | Uncertainty assigned by TRC = 0.5 K |

References

Borgen, 1974
Borgen, G.,
The Conformations of Some gem-Dimethyl Substituted Cyclic Anhydrides.,
Acta Chem. Scand., 1974, 28b, 13, https://doi.org/10.3891/acta.chem.scand.28b-0013
. [all data]