Anthracene, 1-chloro-
- Formula: C14H9Cl
- Molecular weight: 212.674
- IUPAC Standard InChIKey: SRIHSAFSOOUEGL-UHFFFAOYSA-N
- CAS Registry Number: 4985-70-0
- Chemical structure:
View 3d structure (requires JavaScript / HTML 5) - Other names: 1-Chloroanthracene

Phase change data

Data compiled by: William E. Acree, Jr., James S. Chickos
Enthalpy of fusion
ΔfusH (kJ/mol) | Temperature (K) | Reference |
---|---|---|
14.14 | 355.2 | Guarini and Sarti-fantoni, 1969 |

Gas phase ion energetics data

Data compiled by: John E. Bartmess
Electron affinity determinations
EA (eV) | Method | Reference | Comment |
---|---|---|---|
0.83 ± 0.10 | IMRE | Heinis, Chowdhury, et al., 1993 | ΔGea(423 K)= -18.0 kcal/mol , ΔSea=-2.7 (entropy estimated) |

References

Guarini and Sarti-fantoni, 1969
Guarini, G.; Sarti-fantoni, P.,
Calorimetric Study on Some Anthracene Photodimers,
Molecular Crystals, 1969, 6, 3-4, 423-426, https://doi.org/10.1080/15421407008083478
. [all data]
Heinis, Chowdhury, et al., 1993
Heinis, T.; Chowdhury, S.; Kebarle, P.,
Electron Affinities of Naphthalene, Anthracene and Substituted Naphthalenes and Anthracenes,
Org. Mass Spectrom., 1993, 28, 4, 358, https://doi.org/10.1002/oms.1210280416
. [all data]