4-Hydroxy-3-hexanone
- Formula: C6H12O2
- Molecular weight: 116.1583
- IUPAC Standard InChIKey: SKCYVGUCBRYGTE-UHFFFAOYSA-N
- CAS Registry Number: 4984-85-4
- Chemical structure:
View 3d structure (requires JavaScript / HTML 5) - Other names: 3-Hexanone, 4-hydroxy-; Ethyl α-hydroxypropyl ketone; 3-Hydroxy-4-hexanone; Propioin; Propionoin; 4-hydroxyhexan-3-one

Phase change data

Data compiled by: Robert L. Brown and Stephen E. Stein
Reduced pressure boiling point
Tboil (K) | Pressure (bar) | Reference |
---|---|---|
336. to 338. | 0.020 | Frinton Laboratories Inc., 1986 |

Normal alkane RI, non-polar column, temperature ramp

Column type | Active phase | I | Reference | Comment |
---|---|---|---|---|
Capillary | DB-5 | 846. | Dhanda, Pegg, et al., 2003 | 60. m/0.25 mm/0.25 μm, He, 35. C @ 2. min, 5. K/min, 280. C @ 4. min |

References

Frinton Laboratories Inc., 1986
Frinton Laboratories Inc.,
Catalog Number 11, Frinton Laboratories Inc., Vineland, NJ, 1986, 99. [all data]
Dhanda, Pegg, et al., 2003
Dhanda, J.S.; Pegg, R.B.; Shand, P.J.,
Saskatchewan specialty livestock value-added program - Saskatchewan agri-food innovation fund (AFIF) Project #98000016, 2003, retrieved from http://www.agr.gov.sk.ca/afif/Projects/19980016.pdf. [all data]