1-Chloro-2,5-diisopropylbenzene
- Formula: C12H17Cl
- Molecular weight: 196.716
- IUPAC Standard InChIKey: DAQRAOORRPJOKE-UHFFFAOYSA-N
- CAS Registry Number: 49841-53-4
- Chemical structure:
View 3d structure (requires JavaScript / HTML 5) - Permanent link for this species. Use this link for bookmarking this species for future reference.

Condensed phase thermochemistry data

Data compiled by: Hussein Y. Afeefy, Joel F. Liebman, and Stephen E. Stein
Quantity | Value | Units | Method | Reference | Comment |
---|---|---|---|---|---|
ΔfH°liquid | -165.0 ± 3.3 | kJ/mol | Eqk | Nesterova, Rozhnov, et al., 1985 |

Reaction thermochemistry data

Data compiled by: Hussein Y. Afeefy, Joel F. Liebman, and Stephen E. Stein
Individual Reactions
By formula: C12H17Cl = C12H17Cl
Quantity | Value | Units | Method | Reference | Comment |
---|---|---|---|---|---|
ΔrH° | -2.81 ± 0.96 | kJ/mol | Eqk | Nesterova, Rozhnov, et al., 1985 | liquid phase |

References

Nesterova, Rozhnov, et al., 1985
Nesterova, T.N.; Rozhnov, A.M.; Malova, T.N.; Kovzel, E.N.,
Molar enthalpies of formation of isopropylchlorobenzenes derived from equilibrium measurements,
J. Chem. Thermodyn., 1985, 17, 649-656. [all data]