Diphenylene-2,2'-disulfide-S-oxide

Condensed phase thermochemistry data

Data compiled by: Eugene S. Domalski and Elizabeth D. Hearing

Constant pressure heat capacity of solid

Cp,solid (J/mol*K) Temperature (K) Reference Comment
745.2303.Cuccuru, 1975T = 303 to 523 K.

References

Cuccuru, 1975
Cuccuru, A., Thermal properties of some cyclic disulfide-S-oxides:Naphthalene-1,8-disulfide-S-oxide and diphenylene-2,2'-disulfide-S-oxide, Thermochim. Acta, 1975, 13, 96-99. [all data]