2-Butenedioic acid, 2-methyl-, (E)-
- Formula: C5H6O4
- Molecular weight: 130.0987
- IUPAC Standard InChIKey: HNEGQIOMVPPMNR-NSCUHMNNSA-N
- CAS Registry Number: 498-24-8
- Chemical structure:
View 3d structure (requires JavaScript / HTML 5) - Stereoisomers:
- Other names: Mesaconic acid; trans-1-Propene-1,2-dicarboxylic acid; trans-2-Methyl-2-butenedioic acid; Methylfumaric acid; 2-Methylfumaric acid; (E)-2-Methyl-2-butenedioic acid; Butenedioic acid, methyl-, (E)-; Fumaric acid, methyl-; Mesaconate; Kyselina mesakonova; 2-Butenedioic acid, 2-methyl-, (2E)-; NSC 65438

Condensed phase thermochemistry data

Data compiled by: Hussein Y. Afeefy, Joel F. Liebman, and Stephen E. Stein
Quantity | Value | Units | Method | Reference | Comment |
---|---|---|---|---|---|
ΔfH°solid | -824.4 ± 1.5 | kJ/mol | Ccb | Wilhoit and Lei, 1965 | |
Quantity | Value | Units | Method | Reference | Comment |
ΔcH°solid | -2000.6 ± 1.4 | kJ/mol | Ccb | Wilhoit and Lei, 1965 | Reanalyzed by Cox and Pilcher, 1970, Original value = -2001.9 kJ/mol; Corresponding ΔfHºsolid = -824.42 kJ/mol (simple calculation by NIST; no Washburn corrections) |

Reaction thermochemistry data

Data compiled by: Hussein Y. Afeefy, Joel F. Liebman, and Stephen E. Stein
Individual Reactions
By formula: C5H4O3 + H2O = C5H6O4
Quantity | Value | Units | Method | Reference | Comment |
---|---|---|---|---|---|
ΔrH° | -34.0 | kJ/mol | Cm | Conn, Kistiakowsky, et al., 1942 | liquid phase; Heat of hydrolysis at 303 K |
By formula: C5H6O4 + Br2 = C5H6O4 + Br2
Quantity | Value | Units | Method | Reference | Comment |
---|---|---|---|---|---|
ΔrH° | -5.1 ± 0.7 | kJ/mol | Eqk | Jwo, Huang, et al., 1987 | solid phase; HPLC |

References

Wilhoit and Lei, 1965
Wilhoit, R.C.; Lei, I.,
Thermochemistry of biologically important compounds. Heats of combustion of five organic acids.,
J. Chem. Eng. Data, 1965, 10, 166-168. [all data]
Cox and Pilcher, 1970
Cox, J.D.; Pilcher, G.,
Thermochemistry of Organic and Organometallic Compounds, Academic Press, New York, 1970, 1-636. [all data]
Conn, Kistiakowsky, et al., 1942
Conn, J.B.; Kistiakowsky, G.B.; Roberts, R.M.; Smith, E.A.,
Heats of organic reactions. XIII. Heats of hydrolysis of some acid anhydrides,
J. Am. Chem. Soc., 1942, 64, 1747-17. [all data]
Jwo, Huang, et al., 1987
Jwo, J-J.; Huang, C-Y.; Chang, E-F.; Wu, R.R.,
Kinetic study of the bromine-catalyzed isomerization of methyl- and chloro-maleic acids in aqueous Ce(IV)-Br- -H2SO4 medium,
J. Chin. Chem. Soc. (Taipei), 1987, 34, 247-256. [all data]
Jones, Whitham, et al., 1954
Jones, E.R.H.; Whitham, G.H.; Whiting, M.C.,
Researches on acetylenic compounds. Part XLIV. The reaction between nickel carbonyl and some esters of ω-acetylenic acids,
J. Chem. Soc., 1954, 1865-1868. [all data]