2-Butenedioic acid, 2-methyl-, (Z)-
- Formula: C5H6O4
- Molecular weight: 130.0987
- IUPAC Standard InChIKey: HNEGQIOMVPPMNR-IHWYPQMZSA-N
- CAS Registry Number: 498-23-7
- Chemical structure:
View 3d structure (requires JavaScript / HTML 5) - Species with the same structure:
- Stereoisomers:
- Other names: Citraconic acid; Methylmaleic acid; cis-Methylbutenedioic acid; Maleic acid, methyl-; Kyselina citrakonova; 2-Methyl-2-butenedioic acid

Phase change data

Data compiled by: Thermodynamics Research Center, NIST Boulder Laboratories, Chris Muzny director
Quantity | Value | Units | Method | Reference | Comment |
---|---|---|---|---|---|
Tfus | 356.4 | K | N/A | Wilhoit and Lei, 1965 | Uncertainty assigned by TRC = 0.6 K |
Tfus | 356.15 | K | N/A | Wilhoit and Lei, 1965 | Uncertainty assigned by TRC = 0.7 K |

Reaction thermochemistry data

Data compiled by: Hussein Y. Afeefy, Joel F. Liebman, and Stephen E. Stein
Individual Reactions
By formula: C5H6O4 + Br2 = C5H6O4 + Br2
Quantity | Value | Units | Method | Reference | Comment |
---|---|---|---|---|---|
ΔrH° | -5.1 ± 0.7 | kJ/mol | Eqk | Jwo, Huang, et al., 1987 | solid phase; HPLC |

Normal alkane RI, non-polar column, custom temperature program

Column type | Active phase | I | Reference | Comment |
---|---|---|---|---|
Capillary | DB-1 | 1222. | Delort and Jaquier, 2009 | 60. m/0.25 mm/0.25 μm, Helium; Program: 50 0C (5 min) 3 0C/min -> 120 0C 5 0C/min -> 250 0C (3 min) 15 0C/min -> 300 0C (20 min) |

References

Wilhoit and Lei, 1965
Wilhoit, R.C.; Lei, I.,
Thermochemistry of Biologically Important Compounds. Heats of Combustion of Five Organic Acids,
J. Chem. Eng. Data, 1965, 10, 166. [all data]
Jwo, Huang, et al., 1987
Jwo, J-J.; Huang, C-Y.; Chang, E-F.; Wu, R.R.,
Kinetic study of the bromine-catalyzed isomerization of methyl- and chloro-maleic acids in aqueous Ce(IV)-Br- -H2SO4 medium,
J. Chin. Chem. Soc. (Taipei), 1987, 34, 247-256. [all data]
Delort and Jaquier, 2009
Delort, E.; Jaquier, A.,
Novel terpenyl esters from Australian finger lime (Citrus australasica) peel extract,
Flav. Fragr. J., 2009, 24, 3, 123-132, https://doi.org/10.1002/ffj.1922
. [all data]