Butanedioic acid, methyl-
- Formula: C5H8O4
- Molecular weight: 132.1146
- IUPAC Standard InChIKey: WXUAQHNMJWJLTG-UHFFFAOYSA-N
- CAS Registry Number: 498-21-5
- Chemical structure:
View 3d structure (requires JavaScript / HTML 5) - Other names: Succinic acid, methyl-; Methylsuccinic acid; Pyrotartaric acid; 1,2-Propanedicarboxylic acid; Methylbutanedioic acid; 2-Methylsuccinic acid; 2-Methylbutanedioic acid

Condensed phase thermochemistry data

Data compiled as indicated in comments:
ALS - Hussein Y. Afeefy, Joel F. Liebman, and Stephen E. Stein
DH - Eugene S. Domalski and Elizabeth D. Hearing
Quantity | Value | Units | Method | Reference | Comment |
---|---|---|---|---|---|
ΔcH°solid | -2152.7 ± 1.0 | kJ/mol | Ccb | Verkade and Hartman, 1933 | Reanalyzed by Cox and Pilcher, 1970, Original value = -2156. kJ/mol; At 288 K; Corresponding ΔfHºsolid = -958.22 kJ/mol (simple calculation by NIST; no Washburn corrections); ALS |
Constant pressure heat capacity of solid
Cp,solid (J/mol*K) | Temperature (K) | Reference | Comment |
---|---|---|---|
199.6 | 323. | Satoh and Sogabe, 1939 | T = 0 to 100°C. Mean value.; DH |

Phase change data

Data compiled by: Thermodynamics Research Center, NIST Boulder Laboratories, Chris Muzny director
Quantity | Value | Units | Method | Reference | Comment |
---|---|---|---|---|---|
Tboil | 380.65 | K | N/A | Petrov, Razumova, et al., 1959 | Uncertainty assigned by TRC = 2. K |

References

Verkade and Hartman, 1933
Verkade, P.E.; Hartman, H.,
Calorimetric researches XXI. Heats of combustion of methyl-, ethyl- and phenyl-substituted succinic acids and of their anhydrides: a. Experimental data,
Rec. Trav. Chim. Pays/Bas, 1933, 52, 945-968. [all data]
Cox and Pilcher, 1970
Cox, J.D.; Pilcher, G.,
Thermochemistry of Organic and Organometallic Compounds, Academic Press, New York, 1970, 1-636. [all data]
Satoh and Sogabe, 1939
Satoh, S.; Sogabe, T.,
The specific heats of some solid aliphatic acids and their ammonium salts and the atomic heat of nitrogen,
Sci. Pap. Inst. Phys. Chem. Res. (Tokyo), 1939, 36, 97-105. [all data]
Petrov, Razumova, et al., 1959
Petrov, A.A.; Razumova, N.A.; Genusov, M.L.,
Telomerization of α-Chloro-1.3-butadiene with Piperylene Hydochloride (2-chloro-3-pentene),
Nauchn. Dokl. Vyssh. Shk., Khim. Khim. Tekhnol., 1959, No.1, 123. [all data]