(+)-3-Carene
- Formula: C10H16
- Molecular weight: 136.2340
- IUPAC Standard InChIKey: BQOFWKZOCNGFEC-BDAKNGLRSA-N
- CAS Registry Number: 498-15-7
- Chemical structure:
View 3d structure (requires JavaScript / HTML 5) - Stereoisomers:
- Other names: Bicyclo[4.1.0]hept-3-ene, 3,7,7-trimethyl-, (1S)-; 3,7,7-Trimethylbicyclo[4.1.0]hept-3-ene-, (1S,6R)-; Isodiprene; (+)-δ3-Carene; (+)-(-)-3-carene; (1S,3R,6R)-3-Carene; (1S)-3,7,7-trimethylbicyclo[4.1.0]hept-3-ene

Phase change data

Data compiled as indicated in comments:
BS - Robert L. Brown and Stephen E. Stein
AC - William E. Acree, Jr., James S. Chickos
Quantity | Value | Units | Method | Reference | Comment |
---|---|---|---|---|---|
ΔvapH° | 48.5 | kJ/mol | GC | Hoskovec, Grygarová, et al., 2005 | Based on data from 313. to 413. K.; AC |
Reduced pressure boiling point
Tboil (K) | Pressure (bar) | Reference | Comment |
---|---|---|---|
396.7 | 0.267 | Weast and Grasselli, 1989 | BS |
Enthalpy of vaporization
ΔvapH (kJ/mol) | Temperature (K) | Method | Reference | Comment |
---|---|---|---|---|
42.8 | 374. | A | Stephenson and Malanowski, 1987 | Based on data from 359. to 443. K.; AC |

Kovats' RI, non-polar column, isothermal

Data compiled by: NIST Mass Spectrometry Data Center, William E. Wallace, director

Column type CapillaryCapillaryCapillaryCapillaryCapillary
Active phase ZB-1ZB-1ZB-1ZB-1ZB-1
Column length (m) 30.30.30.30.30.
Carrier gas HeHeHeHeHe
Substrate
Column diameter (mm) 0.320.320.320.320.32
Phase thickness (μm) 0.250.250.250.250.25
Temperature (C) 100.110.120.130.140.
I 1012.091015.291018.61021.881025.31
ReferenceHoskovec, Grygarová, et al., 2005Hoskovec, Grygarová, et al., 2005Hoskovec, Grygarová, et al., 2005Hoskovec, Grygarová, et al., 2005Hoskovec, Grygarová, et al., 2005
Comment MSDC-RI MSDC-RI MSDC-RI MSDC-RI MSDC-RI
Column type CapillaryCapillaryCapillaryCapillaryCapillary
Active phase ZB-1ZB-1ZB-1ZB-1ZB-1
Column length (m) 30.30.30.30.30.
Carrier gas HeHeHeHeHe
Substrate
Column diameter (mm) 0.320.320.320.320.32
Phase thickness (μm) 0.250.250.250.250.25
Temperature (C) 40.50.60.70.80.
I 994.21996.991000.1002.831005.88
ReferenceHoskovec, Grygarová, et al., 2005Hoskovec, Grygarová, et al., 2005Hoskovec, Grygarová, et al., 2005Hoskovec, Grygarová, et al., 2005Hoskovec, Grygarová, et al., 2005
Comment MSDC-RI MSDC-RI MSDC-RI MSDC-RI MSDC-RI
Column type Capillary
Active phase ZB-1
Column length (m) 30.
Carrier gas He
Substrate
Column diameter (mm) 0.32
Phase thickness (μm) 0.25
Temperature (C) 90.
I 1008.96
ReferenceHoskovec, Grygarová, et al., 2005
Comment MSDC-RI

Van Den Dool and Kratz RI, non-polar column, custom temperature program

View large format table.

Column type Active phase I Reference Comment
CapillaryDB-1995.Suliman F.E.O., Fatope M.O., et al., 200630. m/0.25 mm/0.25 μm, He; Program: 35C => 2C/min => 200C => 5C/min => 240C

Normal alkane RI, non-polar column, temperature ramp

View large format table.

Column type Active phase I Reference Comment
CapillaryOV-1011002.Orav, Kailas, et al., 200250. m/0.2 mm/0.5 μm, He, 2. K/min; Tstart: 50. C; Tend: 250. C

Normal alkane RI, non-polar column, custom temperature program

View large format table.

Column type Active phase I Reference Comment
CapillaryCBP-51010.Cheriti, Saad, et al., 200730. m/0.25 mm/0.25 μm, He; Program: 60C(2min) => 3C/min => 240C => 10C/min => 300C

Normal alkane RI, polar column, temperature ramp

View large format table.

Column type Active phase I Reference Comment
CapillarySupelcowax-101148.Orav, Kailas, et al., 200260. m/0.2 mm/0.5 μm, He, 2. K/min; Tstart: 70. C; Tend: 220. C

References

Hoskovec, Grygarová, et al., 2005
Hoskovec, Michal; Grygarová, Dana; Cvacka, Josef; Streinz, Ludvík; Zima, Jirí; Verevkin, Sergey P.; Koutek, Bohumír,
Determining the vapour pressures of plant volatiles from gas chromatographic retention data,
Journal of Chromatography A, 2005, 1083, 1-2, 161-172, https://doi.org/10.1016/j.chroma.2005.06.006
. [all data]
Weast and Grasselli, 1989
CRC Handbook of Data on Organic Compounds, 2nd Editon, Weast,R.C and Grasselli, J.G., ed(s)., CRC Press, Inc., Boca Raton, FL, 1989, 1. [all data]
Stephenson and Malanowski, 1987
Stephenson, Richard M.; Malanowski, Stanislaw,
Handbook of the Thermodynamics of Organic Compounds, 1987, https://doi.org/10.1007/978-94-009-3173-2
. [all data]