β-D-Glucopyranose, 1,6-anhydro-
- Formula: C6H10O5
- Molecular weight: 162.1406
- IUPAC Standard InChIKey: TWNIBLMWSKIRAT-RXRWUWDJSA-N
- CAS Registry Number: 498-07-7
- Chemical structure:
View 3d structure (requires JavaScript / HTML 5) - Other names: Anhydro-d-mannosan; Levoglucosan; 1,6-Anhydro-β-D-glucopyranose; 1,6-Anhydro-beta-D-glucopyranose; 1,6-Anhydro-β-D-glucopyranose (levoglucosan); 1,6-anhydro-β-D-glucose

Condensed phase thermochemistry data

Data compiled by: Hussein Y. Afeefy, Joel F. Liebman, and Stephen E. Stein
Quantity | Value | Units | Method | Reference | Comment |
---|---|---|---|---|---|
ΔcH°solid | -2832. ± 0.8 | kJ/mol | Ccb | Skuratov, Kozina, et al., 1957 | At 20C; Corresponding ΔfHºsolid = -958.6 kJ/mol (simple calculation by NIST; no Washburn corrections) |
ΔcH°solid | -2875.1 | kJ/mol | Ccb | Karrer, Nageli, et al., 1921 | Corresponding ΔfHºsolid = -915.08 kJ/mol (simple calculation by NIST; no Washburn corrections) |

Phase change data

Data compiled by: William E. Acree, Jr., James S. Chickos
Enthalpy of vaporization
ΔvapH (kJ/mol) | Temperature (K) | Method | Reference | Comment |
---|---|---|---|---|
92.2 | 483. | A | Stephenson and Malanowski, 1987 | Based on data from 468. to 528. K. See also Einstein, Duronina, et al., 1964 and Dykyj, 1972. |
Enthalpy of sublimation
ΔsubH (kJ/mol) | Temperature (K) | Method | Reference | Comment |
---|---|---|---|---|
125.1 ± 1.0 | 365. | ME | Oja and Suuberg, 1999 | Based on data from 344. to 386. K. |
100.3 ± 5.9 | 395. | ME | Oja and Suuberg, 1999 | Based on data from 386. to 405. K. |

Van Den Dool and Kratz RI, non-polar column, custom temperature program

Column type | Active phase | I | Reference | Comment |
---|---|---|---|---|
Capillary | LM-5 | 1491.1 | Ré-Poppi and Santiago-Silva, 2005 | 30. m/0.25 mm/0.25 μm, He; Program: 60C(2min) => 15C/min => 180C => 5C/min => 280C (10min) |

References

Skuratov, Kozina, et al., 1957
Skuratov, S.M.; Kozina, M.L.; Shteher, S.M.; Varushyenko, R.M.,
The heats of combustion of several purified compounds,
Thermochem. Bull. (Moscow State Univ.), March, 1957, 36-37. [all data]
Karrer, Nageli, et al., 1921
Karrer, P.; Nageli, C.; Hurwitz, O.; Walti, A.,
Polysaccharide VIII. Zur Kenntnis der Starke und der Amylosen,
Ber., 1921, 4, 678-699. [all data]
Stephenson and Malanowski, 1987
Stephenson, Richard M.; Malanowski, Stanislaw,
Handbook of the Thermodynamics of Organic Compounds, 1987, https://doi.org/10.1007/978-94-009-3173-2
. [all data]
Einstein, Duronina, et al., 1964
Einstein, J.V.; Duronina, L.I.; Pashinkin, A.S.,
Zh. Prikl. Khim. (S.-Peterburg), 1964, 37, 2543. [all data]
Dykyj, 1972
Dykyj, J.,
Petrochemia, 1972, 12, 1, 13. [all data]
Oja and Suuberg, 1999
Oja, V.; Suuberg, E.M.,
Vapor Pressures and Enthalpies of Sublimation of,
J. Chem. Eng. Data, 1999, 44, 1, 26-29, https://doi.org/10.1021/je980119b
. [all data]
Ré-Poppi and Santiago-Silva, 2005
Ré-Poppi, N.; Santiago-Silva, M.,
Polycyclic aromatic hydrocarbons and other selected organic compounds in ambient air of Campo Grande City, Brazil,
Atmos. Environ., 2005, 39, 16, 2839-2850, https://doi.org/10.1016/j.atmosenv.2004.10.006
. [all data]