4-Methyl-2-tert-octylphenol
- Formula: C15H24O
- Molecular weight: 220.3505
- IUPAC Standard InChIKey: MWJFTXUNWYQEIU-UHFFFAOYSA-N
- CAS Registry Number: 4979-46-8
- Chemical structure:
View 3d structure (requires JavaScript / HTML 5) - Other names: 4-Methyl-2-t-octylphenol; 2-(1,1,3,3-Tetramethylbutyl)-p-cresol; p-Cresol, 2-(1,1,3,3-tetramethylbutyl); 4-Methyl-2-(1,1,3,3-tetramethylbutyl)phenol

Phase change data

Data compiled as indicated in comments:
TRC - Thermodynamics Research Center, NIST Boulder Laboratories, Chris Muzny director
AC - William E. Acree, Jr., James S. Chickos
Quantity | Value | Units | Method | Reference | Comment |
---|---|---|---|---|---|
Tfus | 449.17 | K | N/A | Witschonke, 1954 | Uncertainty assigned by TRC = 0.3 K; TRC |
Tfus | 449.45 | K | N/A | Witschonke, 1954 | Uncertainty assigned by TRC = 0.2 K; TRC |
Enthalpy of vaporization
ΔvapH (kJ/mol) | Temperature (K) | Method | Reference | Comment |
---|---|---|---|---|
65.0 | 430. | A | Stephenson and Malanowski, 1987 | Based on data from 415. to 545. K.; AC |

References

Witschonke, 1954
Witschonke, C.R.,
Freezing point and purity data for some organic compounds,
Anal. Chem., 1954, 26, 562-4. [all data]
Stephenson and Malanowski, 1987
Stephenson, Richard M.; Malanowski, Stanislaw,
Handbook of the Thermodynamics of Organic Compounds, 1987, https://doi.org/10.1007/978-94-009-3173-2
. [all data]