exo-Norbornyl alcohol
- Formula: C7H12O
- Molecular weight: 112.1696
- IUPAC Standard InChIKey: ZQTYQMYDIHMKQB-KPGICGJXSA-N
- CAS Registry Number: 497-37-0
- Chemical structure:
View 3d structure (requires JavaScript / HTML 5) - Stereoisomers:
- Other names: Bicyclo[2.2.1]heptan-2-ol, exo-; 2-Norbornanol, exo-; exo-Bicyclo[2.2.1]heptan-2-ol; exo-Norbornanol; exo-Norborneol; exo-2-Norbornanol; exo-2-Norborneol; exo-2-Norbornyl alcohol; 2-exo-Norbornanol; 2-exo-Norborneol; Bicyclo[2.2.1]heptan-2-ol, (1R,2R,4S)-rel-; NSC 167460

Condensed phase thermochemistry data

Data compiled by: Hussein Y. Afeefy, Joel F. Liebman, and Stephen E. Stein
Quantity | Value | Units | Method | Reference | Comment |
---|---|---|---|---|---|
ΔfH°liquid | -279. ± 2. | kJ/mol | Cac | Wiberg, Wasserman, et al., 1985 | Trifluoroacetolysis |
Quantity | Value | Units | Method | Reference | Comment |
ΔfH°solid | -281. ± 2. | kJ/mol | Cac | Wiberg, Wasserman, et al., 1985 | Trifluoroacetolysis |

Phase change data

Data compiled as indicated in comments:
BS - Robert L. Brown and Stephen E. Stein
AC - William E. Acree, Jr., James S. Chickos
Quantity | Value | Units | Method | Reference | Comment |
---|---|---|---|---|---|
Tboil | 449.7 | K | N/A | Aldrich Chemical Company Inc., 1990 | BS |
Quantity | Value | Units | Method | Reference | Comment |
ΔvapH° | 52.5 | kJ/mol | GC | van Roon, Parsons, et al., 2002 | AC |

Reaction thermochemistry data

Data compiled by: Hussein Y. Afeefy, Joel F. Liebman, and Stephen E. Stein
Individual Reactions
By formula: C4F6O3 + C7H12O = C9H11F3O2 + C2HF3O2
Quantity | Value | Units | Method | Reference | Comment |
---|---|---|---|---|---|
ΔrH° | -91.09 ± 0.14 | kJ/mol | Cac | Wiberg, Wasserman, et al., 1985 | liquid phase; Trifluoroacetolysis |

Kovats' RI, polar column, isothermal

Column type | Active phase | Temperature (C) | I | Reference | Comment |
---|---|---|---|---|---|
Packed | Carbowax 20M | 140. | 1544. | Heintz, Gruselle, et al., 1976 | Chromosorb W (60-80 mesh); Column length: 2. m |

References

Wiberg, Wasserman, et al., 1985
Wiberg, K.B.; Wasserman, D.J.; Martin, E.J.; Murcko, M.A.,
Enthalpies of hydration of alkenes. 3. Cycloalkenes,
J. Am. Chem. Soc., 1985, 107, 6019-6022. [all data]
Aldrich Chemical Company Inc., 1990
Aldrich Chemical Company Inc.,
Catalog Handbook of Fine Chemicals, Aldrich Chemical Company, Inc., Milwaukee WI, 1990, 1. [all data]
van Roon, Parsons, et al., 2002
van Roon, André; Parsons, John R.; Govers, Harrie A.J.,
Gas chromatographic determination of vapour pressure and related thermodynamic properties of monoterpenes and biogenically related compounds,
Journal of Chromatography A, 2002, 955, 1, 105-115, https://doi.org/10.1016/S0021-9673(02)00200-5
. [all data]
Heintz, Gruselle, et al., 1976
Heintz, M.; Gruselle, M.; Druilhe, A.; Lefort, D.,
Relations entre structure chimique et données de rétention en chromatographie en phase gaseuse. VI. Alcools et esters méthyliques de structures cycliques,
Chromatographia, 1976, 9, 8, 367-372, https://doi.org/10.1007/BF02330385
. [all data]