Bicyclo[2.2.1]heptan-2-ol, endo-
- Formula: C7H12O
- Molecular weight: 112.1696
- IUPAC Standard InChIKey: ZQTYQMYDIHMKQB-UHFFFAOYSA-N
- CAS Registry Number: 497-36-9
- Chemical structure:
View 3d structure (requires JavaScript / HTML 5) - Species with the same structure:
- Stereoisomers:
- Other names: 2-Norbornanol, endo-; α-Norborneol; endo-Bicyclo[2.2.1]heptan-2-ol; endo-Norbornanol; endo-Norborneol; endo-2-Norbornanol; endo-2-Norborneol; 2-endo-Norbornanol

Kovats' RI, polar column, isothermal

Column type | Active phase | Temperature (C) | I | Reference | Comment |
---|---|---|---|---|---|
Packed | Carbowax 20M | 140. | 1558. | Heintz, Gruselle, et al., 1976 | Chromosorb W (60-80 mesh); Column length: 2. m |

References

Heintz, Gruselle, et al., 1976
Heintz, M.; Gruselle, M.; Druilhe, A.; Lefort, D.,
Relations entre structure chimique et données de rétention en chromatographie en phase gaseuse. VI. Alcools et esters méthyliques de structures cycliques,
Chromatographia, 1976, 9, 8, 367-372, https://doi.org/10.1007/BF02330385
. [all data]