2-chloropropane-1,3-diol
- Formula: C3H7ClO2
- Molecular weight: 110.539
- CAS Registry Number: 497-04-1

Condensed phase thermochemistry data

Data compiled by: Hussein Y. Afeefy, Joel F. Liebman, and Stephen E. Stein
Quantity | Value | Units | Method | Reference | Comment |
---|---|---|---|---|---|
ΔfH°liquid | -517.6 ± 0.8 | kJ/mol | Ccr | Bjellerup and Smith, 1954 | At 293 K |
Quantity | Value | Units | Method | Reference | Comment |
ΔcH°liquid | -1687. ± 0.8 | kJ/mol | Ccr | Bjellerup and Smith, 1954 | At 293 K |
ΔcH°liquid | -2148.78 ± 0.97 | kJ/mol | Ccb | Smith and Schjdnberg, 1931 | Not corrected for CODATA value of ΔfH |

Phase change data

Data compiled by: Robert L. Brown and Stephen E. Stein
Reduced pressure boiling point
Tboil (K) | Pressure (bar) | Reference |
---|---|---|
419.2 | 0.024 | Weast and Grasselli, 1989 |

References

Bjellerup and Smith, 1954
Bjellerup, L.; Smith, L.,
Heats of combustion of some organic chloro-compounds,
Kgl. Fysiograph. Sallskap. Lund Forh., 1954, 24, 1-13. [all data]
Smith and Schjdnberg, 1931
Smith, L.; Schjdnberg, E.,
Uber die Verbrennung von chlorhaltigen Substanzen in Berthelots Bombe,
Svensk Kemisk Tidskrift, 1931, 213-226. [all data]
Weast and Grasselli, 1989
CRC Handbook of Data on Organic Compounds, 2nd Editon, Weast,R.C and Grasselli, J.G., ed(s)., CRC Press, Inc., Boca Raton, FL, 1989, 1. [all data]