5-Hydroxy-4-octanone
- Formula: C8H16O2
- Molecular weight: 144.2114
- IUPAC Standard InChIKey: BVEYJWQCMOVMAR-UHFFFAOYSA-N
- CAS Registry Number: 496-77-5
- Chemical structure:
View 3d structure (requires JavaScript / HTML 5) - Other names: Butyroin; 4-Octanone, 5-hydroxy-; 5-Octanol-4-one; 5-hydroxyoctan-4-one

Phase change data

Data compiled by: Robert L. Brown and Stephen E. Stein
Quantity | Value | Units | Method | Reference | Comment |
---|---|---|---|---|---|
Tboil | 458.2 | K | N/A | Weast and Grasselli, 1989 |
Reduced pressure boiling point
Tboil (K) | Pressure (bar) | Reference |
---|---|---|
353. to 359. | 0.016 | Frinton Laboratories Inc., 1986 |

References

Weast and Grasselli, 1989
CRC Handbook of Data on Organic Compounds, 2nd Editon, Weast,R.C and Grasselli, J.G., ed(s)., CRC Press, Inc., Boca Raton, FL, 1989, 1. [all data]
Frinton Laboratories Inc., 1986
Frinton Laboratories Inc.,
Catalog Number 11, Frinton Laboratories Inc., Vineland, NJ, 1986, 99. [all data]