4-methylresorcinol

Phase change data

Data compiled by: William E. Acree, Jr., James S. Chickos

Quantity Value Units Method Reference Comment
Δsub107.3 ± 3.0kJ/molMERibeiro da Silva and Lobo Ferreira, 2009Based on data from 317. - 333. K.

Enthalpy of vaporization

ΔvapH (kJ/mol) Temperature (K) Method Reference Comment
72.2406.A,GCStephenson and Malanowski, 1987Based on data from 391. - 459. K. See also Kundel, Lille, et al., 1975.

Enthalpy of sublimation

ΔsubH (kJ/mol) Temperature (K) Method Reference Comment
106.8 ± 0.9325.MERibeiro da Silva and Lobo Ferreira, 2009Based on data from 317. - 333. K.

Enthalpy of fusion

ΔfusH (kJ/mol) Temperature (K) Reference
27.6404.2Verevkin, 1999

References

Ribeiro da Silva and Lobo Ferreira, 2009
Ribeiro da Silva, Manuel A.V.; Lobo Ferreira, Ana I.M.C., Experimental standard molar enthalpies of formation of some methylbenzenediol isomers, The Journal of Chemical Thermodynamics, 2009, 41, 10, 1096-1103, https://doi.org/10.1016/j.jct.2009.04.015 . [all data]

Stephenson and Malanowski, 1987
Stephenson, Richard M.; Malanowski, Stanislaw, Handbook of the Thermodynamics of Organic Compounds, 1987, https://doi.org/10.1007/978-94-009-3173-2 . [all data]

Kundel, Lille, et al., 1975
Kundel, H.; Lille, U.; Kaidas, N., Tr. Tallin. Politekh. Inst., 1975, 390, 107. [all data]

Verevkin, 1999
Verevkin, Sergey P., Substituent effects on the benzene ring. Prediction of the thermochemical properties of alkyl substituted hydroquinones, Phys. Chem. Chem. Phys., 1999, 1, 1, 127-131, https://doi.org/10.1039/a806706f . [all data]