1,2-Benzenediamine, 4-methyl-
- Formula: C7H10N2
- Molecular weight: 122.1677
- IUPAC Standard InChIKey: DGRGLKZMKWPMOH-UHFFFAOYSA-N
- CAS Registry Number: 496-72-0
- Chemical structure:
View 3d structure (requires JavaScript / HTML 5) - Other names: Toluene-3,4-diamine; 1,2-Diamino-4-methylbenzene; 3,4-Diamino-1-methylbenzene; 3,4-Diaminotoluene; 3,4-Toluenediamine; 3,4-Toluylenediamine; 3,4-Tolylenediamine; 4-Methyl-o-phenylenediamine; 4-Methyl-1,2-diaminobenzene; 4-Methyl-1,2-phenylenediamine; 4-Methyl-1,2-benzenediamine; NSC 1495

Phase change data

Data compiled by: Robert L. Brown and Stephen E. Stein
Quantity | Value | Units | Method | Reference | Comment |
---|---|---|---|---|---|
Tboil | 538.2 | K | N/A | Weast and Grasselli, 1989 |
Reduced pressure boiling point
Tboil (K) | Pressure (atm) | Reference |
---|---|---|
428.7 | 0.024 | Aldrich Chemical Company Inc., 1990 |

References

Weast and Grasselli, 1989
CRC Handbook of Data on Organic Compounds, 2nd Editon, Weast,R.C and Grasselli, J.G., ed(s)., CRC Press, Inc., Boca Raton, FL, 1989, 1. [all data]
Aldrich Chemical Company Inc., 1990
Aldrich Chemical Company Inc.,
Catalog Handbook of Fine Chemicals, Aldrich Chemical Company, Inc., Milwaukee WI, 1990, 1. [all data]