Benzofuran-2-carboxylic acid
- Formula: C9H6O3
- Molecular weight: 162.1421
- IUPAC Standard InChIKey: OFFSPAZVIVZPHU-UHFFFAOYSA-N
- CAS Registry Number: 496-41-3
- Chemical structure:
View 3d structure (requires JavaScript / HTML 5) - Other names: Coumarilic acid; Benzo[b]furan-2-carboxylic acid; 2-Benzofurancarboxylic acid; Coumarone-2-carboxylic acid; 2-Carboxybenzofuran

Phase change data

Data compiled by: Robert L. Brown and Stephen E. Stein
Quantity | Value | Units | Method | Reference | Comment |
---|---|---|---|---|---|
Tboil | 585.7 | K | N/A | Weast and Grasselli, 1989 | |
Tboil | 583. to 588. | K | N/A | Buckingham and Donaghy, 1982 | |
Quantity | Value | Units | Method | Reference | Comment |
Tfus | 465. to 466. | K | N/A | Buckingham and Donaghy, 1982 |

References

Weast and Grasselli, 1989
CRC Handbook of Data on Organic Compounds, 2nd Editon, Weast,R.C and Grasselli, J.G., ed(s)., CRC Press, Inc., Boca Raton, FL, 1989, 1. [all data]
Buckingham and Donaghy, 1982
Buckingham, J.; Donaghy, S.M.,
Dictionary of Organic Compounds: Fifth Edition, Chapman and Hall, New York, 1982, 1. [all data]
Lang (editor), 1961
Lang (editor), L.,
Absorption Spectra in the Ultraviolet and Visible Region, 1961, 2, 159. [all data]