Phthalan
- Formula: C8H8O
- Molecular weight: 120.1485
- IUPAC Standard InChIKey: SFLGSKRGOWRGBR-UHFFFAOYSA-N
- CAS Registry Number: 496-14-0
- Chemical structure:
View 3d structure (requires JavaScript / HTML 5) - Other names: 1,3-Dihydro isobenzofuran; Isobenzofuran, 1,3-dihydro-; Isobenzofuran

Phase change data

Data compiled as indicated in comments:
BS - Robert L. Brown and Stephen E. Stein
TRC - Thermodynamics Research Center, NIST Boulder Laboratories, Chris Muzny director
ALS - Hussein Y. Afeefy, Joel F. Liebman, and Stephen E. Stein
DRB - Donald R. Burgess, Jr.
AC - William E. Acree, Jr., James S. Chickos
Quantity | Value | Units | Method | Reference | Comment |
---|---|---|---|---|---|
Tboil | 465.2 | K | N/A | Aldrich Chemical Company Inc., 1990 | BS |
Quantity | Value | Units | Method | Reference | Comment |
Tc | 700. | K | N/A | Steele, Chirico, et al., 1996 | Uncertainty assigned by TRC = 4. K; fitting parameter in Wagner equation for vapor pressure; TRC |
Quantity | Value | Units | Method | Reference | Comment |
Pc | 42.85 | bar | N/A | Steele, Chirico, et al., 1996 | Uncertainty assigned by TRC = 4.00 bar; from extrapolation of obs. vapor pressure to Tc; TRC |
Quantity | Value | Units | Method | Reference | Comment |
ρc | 2.807 | mol/l | N/A | Steele, Chirico, et al., 1996 | Uncertainty assigned by TRC = 0.17 mol/l; TRC |
Quantity | Value | Units | Method | Reference | Comment |
ΔvapH° | 53.74 ± 0.42 | kJ/mol | V | Steele, Chirico, et al., 1996, 2 | ALS |
ΔvapH° | 53.7 | kJ/mol | N/A | Steele, Chirico, et al., 1996, 2 | DRB |
ΔvapH° | 53.7 ± 0.4 | kJ/mol | EB | Steele, Chirico, et al., 1996, 2 | Based on data from 285. to 510. K.; AC |

Gas phase thermochemistry data

Data compiled by: Hussein Y. Afeefy, Joel F. Liebman, and Stephen E. Stein

Quantity Value Units Method Reference Comment
Δfgas-7.19 ± 0.24kcal/molCcrSteele, Chirico, et al., 1996

Condensed phase thermochemistry data

Data compiled as indicated in comments:
ALS - Hussein Y. Afeefy, Joel F. Liebman, and Stephen E. Stein
DH - Eugene S. Domalski and Elizabeth D. Hearing

Quantity Value Units Method Reference Comment
Δfliquid-20.04 ± 0.22kcal/molCcrSteele, Chirico, et al., 1996ALS
Quantity Value Units Method Reference Comment
Δcliquid-1005.63 ± 0.13kcal/molCcrSteele, Chirico, et al., 1996Corresponding Δfliquid = -20.04 kcal/mol (simple calculation by NIST; no Washburn corrections); ALS

Constant pressure heat capacity of liquid

Cp,liquid (cal/mol*K) Temperature (K) Reference Comment
45.10298.15Steele, Chirico, et al., 1993DH

References

Aldrich Chemical Company Inc., 1990
Aldrich Chemical Company Inc.,
Catalog Handbook of Fine Chemicals, Aldrich Chemical Company, Inc., Milwaukee WI, 1990, 1. [all data]
Steele, Chirico, et al., 1996
Steele, W.V.; Chirico, R.D.; Knipmeyer, S.E.; Nguyen, A.; Smith, N.K.; Tasker, I.R.,
Thermodynamic Properties and Ideal-Gas Enthalpies of Formation for Dioctylamine, trioctylamine, Phenyl Isocyanate, and 1,4,5,6-Tetrahydropyrimidine,
J. Chem. Eng. Data, 1996, 41, 1269-84. [all data]
Steele, Chirico, et al., 1996, 2
Steele, W.V.; Chirico, R.D.; Knipmeyer, S.E.; Nguyen, A.; Smith, N.K.; Tasker, I.R.,
Thermodynamic properties and ideal-gas enthalpies of formation for cyclohexene, phthalan (2,5-dihydrobenzo-3,4-furan), isoxazole, octylamine, dioctylamine, trioctylamine, phenyl isocyanate, and 1,4,5,6-tetrahydropyrimidine,
J. Chem. Eng. Data, 1996, 41, 1269-1284. [all data]