1H-Indene, octahydro-
- Formula: C9H16
- Molecular weight: 124.2233
- IUPAC Standard InChIKey: BNRNAKTVFSZAFA-UHFFFAOYSA-N
- CAS Registry Number: 496-10-6
- Chemical structure:
View 3d structure (requires JavaScript / HTML 5) - Species with the same structure:
- Stereoisomers:
- Other names: Indan, hexahydro-; Bicyclo[4.3.0]nonane; Hexahydroindan; Hydrindan; Hydrindane; Bicyclo[4.3.0]nonane,c&t; 1H-Indene, perhydro; Indene, octahydro

Condensed phase thermochemistry data

Data compiled as indicated in comments:
ALS - Hussein Y. Afeefy, Joel F. Liebman, and Stephen E. Stein
DH - Eugene S. Domalski and Elizabeth D. Hearing
Quantity | Value | Units | Method | Reference | Comment |
---|---|---|---|---|---|
ΔcH°liquid | -5588.6 | kJ/mol | Ccb | Gollis, Belenyessy, et al., 1962 | Corresponding ΔfHºliquid = -239.6 kJ/mol (simple calculation by NIST; no Washburn corrections); ALS |
Constant pressure heat capacity of liquid
Cp,liquid (J/mol*K) | Temperature (K) | Reference | Comment |
---|---|---|---|
217.1 | 313. | Gudinowicz, Campbell, et al., 1963 | T = 313 to 423 K.; DH |
219.7 | 311. | Gollis, Belenyessy, et al., 1962, 2 | Temperatures 100, 200, 300°F.; DH |

Phase change data

Data compiled by: Thermodynamics Research Center, NIST Boulder Laboratories, Chris Muzny director
Quantity | Value | Units | Method | Reference | Comment |
---|---|---|---|---|---|
Tboil | 437. | K | N/A | Greensfelder and Voge, 1945 | Uncertainty assigned by TRC = 10. K |
Quantity | Value | Units | Method | Reference | Comment |
Tfus | 230. | K | N/A | Gollis, Belenyessy, et al., 1962, 3 | Uncertainty assigned by TRC = 1.66 K |

Normal alkane RI, non-polar column, custom temperature program

Column type | Active phase | I | Reference | Comment |
---|---|---|---|---|
Capillary | Squalane | 991. | Chen, 2008 | Program: not specified |
Capillary | Methyl Silicone | 999. | Zenkevich, 2000 | Program: not specified |
Capillary | SPB-1 | 977. | Flanagan, Streete, et al., 1997 | 60. m/0.53 mm/5. μm, He; Program: 40C(6min) => 5C/min => 80C => 10C/min => 200C |
Capillary | SPB-1 | 977. | Strete, Ruprah, et al., 1992 | 60. m/0.53 mm/5.0 μm, Helium; Program: 40 0C (6 min) 5 0C/min -> 80 0C 10 0C/min -> 200 0C |
Capillary | OV-1, SE-30, Methyl silicone, SP-2100, OV-101, DB-1, etc. | 940. | Waggott and Davies, 1984 | Hydrogen; Column length: 50. m; Column diameter: 0.32 mm; Program: not specified |

References

Gollis, Belenyessy, et al., 1962
Gollis, M.H.; Belenyessy, L.I.; Gudzinowicz, B.J.; Koch, S.D.; Smith, J.O.; Wineman, R.J.,
Evaluation of pure hydrocarbons as jet fuels,
J. Chem. Eng. Data, 1962, 7, 331-316. [all data]
Gudinowicz, Campbell, et al., 1963
Gudinowicz, B.J.; Campbell, R.H.; Adams, J.S.,
Specific heat measurements of complex saturated hydrocarbons,
J. Chem. Eng. Data, 1963, 8, 201-214. [all data]
Gollis, Belenyessy, et al., 1962, 2
Gollis, M.H.; Belenyessy, L.I.; Gudzinowicz, B.J.; Koch, S.D.; Smith, J.O.; Wineman, R.J.,
Evaluations of pure hydrocarbons as Jet Fuels,
J. Chem. Eng. Data, 1962, 7, 311-316. [all data]
Greensfelder and Voge, 1945
Greensfelder, B.S.; Voge, H.H.,
Catalytic Cracking of Pure Hydrodarbons. Cracking of Naphthenes,
Ind. Eng. Chem., 1945, 37, 1038-43. [all data]
Gollis, Belenyessy, et al., 1962, 3
Gollis, M.H.; Belenyessy, L.I.; Gudzinowicz, B.J.; Koch, S.D.; Smith, J.O.; Wineman, R.J.,
Evaluation of pure hydrocarbons as jet fuels.,
J. Chem. Eng. Data, 1962, 7, 311-6. [all data]
Chen, 2008
Chen, H.-F.,
Quantitative prediction of gas chromatography retention indices with support vector machines, radial basis neutral networks and multiple linear regression,
Anal. Chim. Acta, 2008, 609, 1, 24-36, https://doi.org/10.1016/j.aca.2008.01.003
. [all data]
Zenkevich, 2000
Zenkevich, I.G.,
Mutual Correlation between Gas Chromatographic Retention Indices of Unsaturated and Saturated Hydrocarbons found by Molecular Dynamics,
Z. Anal. Chem., 2000, 55, 10, 1091-1097. [all data]
Flanagan, Streete, et al., 1997
Flanagan, R.J.; Streete, P.J.; Ramsey, J.D.,
Volatile Substance Abuse, UNODC Technical Series, No 5, United Nations, Office on Drugs and Crime, Vienna International Centre, PO Box 500, A-1400 Vienna, Austria, 1997, 56, retrieved from http://www.odccp.org/pdf/technicalseries1997-01-011.pdf. [all data]
Strete, Ruprah, et al., 1992
Strete, P.J.; Ruprah, M.; Ramsey, J.D.; Flanagan, R.J.,
Detection and identification of volatile substances by headspace capillary gas chromatography to aid the diagnosis of acute poisoning,
Analyst, 1992, 117, 7, 1111-1127, https://doi.org/10.1039/an9921701111
. [all data]
Waggott and Davies, 1984
Waggott, A.; Davies, I.W.,
Identification of organic pollutants using linear temperature programmed retention indices (LTPRIs) - Part II, 1984, retrieved from http://dwi.defra.gov.uk/research/completed-research/reports/dwi0383.pdf. [all data]