7-Aminoclonazepam
- Formula: C15H12ClN3O
- Molecular weight: 285.728
- IUPAC Standard InChIKey: HEFRPWRJTGLSSV-UHFFFAOYSA-N
- CAS Registry Number: 4959-17-5
- Chemical structure:
View 3d structure (requires JavaScript / HTML 5) - Other names: 7-Amino-5-(2-chlorophenyl)-1,3-dihydro-2H-1,4-benzodiazepin-2-one; Chloraminazepam; Aminoclonazepam; Ro 5-461; 2H-1,4-Benzodiazepin-2-one, 7-amino-5-(2-chlorophenyl)-1,3-dihydro-

Kovats' RI, non-polar column, isothermal

Column type | Active phase | Temperature (C) | I | Reference | Comment |
---|---|---|---|---|---|
Packed | SE-30 | 280. | 2905. | Schütz, 1982 | N2 |
Packed | SE-30 | 280. | 2905. | Schuetz and Westenberger, 1979 | N2, Chromosorb G AW DMCS (80-100 mesh); Column length: 1.5 m |

Van Den Dool and Kratz RI, non-polar column, custom temperature program

Column type | Active phase | I | Reference | Comment |
---|---|---|---|---|
Capillary | VF-5MS | 2940.2 | Tret'yakov, 2008 | 30. m/0.25 mm/0.25 μm, He; Program: Multi-step temperature program; T(initial)=60C; T(final)=270C |

Normal alkane RI, non-polar column, custom temperature program

Column type | Active phase | I | Reference | Comment |
---|---|---|---|---|
Other | Methyl Silicone | 2900. | Ardrey and Moffat, 1981 | Program: not specified |

References

Schütz, 1982
Schütz, H.,
Benzodiazepines, Springer-Verlag, New York, 1982, 438. [all data]
Schuetz and Westenberger, 1979
Schuetz, H.; Westenberger, V.,
Gas chromatographic data of 31 benzodiazepines and metabolites,
J. Chromatogr., 1979, 169, 409-411, https://doi.org/10.1016/0021-9673(75)85071-0
. [all data]
Tret'yakov, 2008
Tret'yakov, K.V.,
Retention Data. NIST Mass Spectrometry Data Center., NIST Mass Spectrometry Data Center, 2008. [all data]
Ardrey and Moffat, 1981
Ardrey, R.E.; Moffat, A.C.,
Gas-liquid chromatographic retention indices of 1318 substances of toxicological interest on SE-30 or OV-1 stationary phase,
J. Chromatogr., 1981, 220, 3, 195-252, https://doi.org/10.1016/S0021-9673(00)81925-1
. [all data]