Piperonyl alcohol
- Formula: C8H8O3
- Molecular weight: 152.1473
- IUPAC Standard InChIKey: BHUIUXNAPJIDOG-UHFFFAOYSA-N
- CAS Registry Number: 495-76-1
- Chemical structure:
View 3d structure (requires JavaScript / HTML 5) - Other names: 1,3-Benzodioxole-5-methanol; Benzyl alcohol, 3,4-(methylenedioxy)-; Piperonol; 1-Hydroxymethyl-3,4-methylenedioxybenzene; 3,4-Methylenedioxybenzyl alcohol; 5-Hydroxymethyl-1,3-benzodioxole; 3,4-(Methylenedioxy)benzenemethanol; 1,3-Benzodioxol-5-ylmethanol; NSC 26265

Phase change data

Data compiled as indicated in comments:
BS - Robert L. Brown and Stephen E. Stein
AC - William E. Acree, Jr., James S. Chickos
Quantity | Value | Units | Method | Reference | Comment |
---|---|---|---|---|---|
ΔsubH° | 103.7 ± 0.7 | kJ/mol | ME | Matos, Monte, et al., 2004 | Based on data from 305. to 319. K.; AC |
Reduced pressure boiling point
Tboil (K) | Pressure (bar) | Reference | Comment |
---|---|---|---|
432. to 434. | 0.027 | Frinton Laboratories Inc., 1986 | BS |
Enthalpy of sublimation
ΔsubH (kJ/mol) | Temperature (K) | Method | Reference | Comment |
---|---|---|---|---|
103.0 ± 0.6 | 312. | ME | Matos, Monte, et al., 2004 | Based on data from 305. to 319. K.; AC |
Enthalpy of fusion
ΔfusH (kJ/mol) | Temperature (K) | Reference | Comment |
---|---|---|---|
18.05 | 327.1 | Matos, Monte, et al., 2004 | AC |

References

Matos, Monte, et al., 2004
Matos, M. Agostinha R.; Monte, Manuel J.S.; Sousa, Clara C.S.; Almeida, Ana R.R.P.; Morais, Victor M.F.,
Thermodynamic study of sesamol, piperonyl alcohol, piperonylic acid and homopiperonylic acid: a combined experimental and theoretical investigation,
Org. Biomol. Chem., 2004, 2, 6, 908, https://doi.org/10.1039/b400107a
. [all data]
Frinton Laboratories Inc., 1986
Frinton Laboratories Inc.,
Catalog Number 11, Frinton Laboratories Inc., Vineland, NJ, 1986, 99. [all data]