2,6,9,11-Dodecatetraenal, 2,6,10-trimethyl-
- Formula: C15H22O
- Molecular weight: 218.3346
- IUPAC Standard InChIKey: PFSTYGCNVAVZBK-UHFFFAOYSA-N
- CAS Registry Number: 4955-32-2
- Chemical structure:
View 3d structure (requires JavaScript / HTML 5) - Stereoisomers:
- Other names: 2,6,10-Trimethyl-2,6,9,11-dodecatetraenal; β-Sinensal

Kovats' RI, non-polar column, custom temperature program

Column type | Active phase | I | Reference | Comment |
---|---|---|---|---|
Capillary | HP-5MS | 1686. | Mevy, Bousquet-Melou, et al., 2006 | 30. m/0.25 mm/0.25 μm, He; Program: 50C(2min) => 2C/min => 160C(5min) => 50C/min => 270C (6min) |

Normal alkane RI, non-polar column, temperature ramp

Column type | Active phase | I | Reference | Comment |
---|---|---|---|---|
Capillary | HP-5 MS | 1704. | Pripdeevech and Saansoomchai, 2013 | 30. m/0.25 mm/0.25 μm, Helium, 3. K/min; Tstart: 60. C; Tend: 230. C |

Normal alkane RI, non-polar column, custom temperature program

Column type | Active phase | I | Reference | Comment |
---|---|---|---|---|
Capillary | Siloxane, 5 % Ph | 1719. | VOC BinBase, 2012 | Program: not specified |
Capillary | Polydimethyl siloxane, 5 % phenyl | 1719. | Skogerson, Wohlgemuth, et al., 2011 | Program: not specified |

References

Mevy, Bousquet-Melou, et al., 2006
Mevy, J.P.; Bousquet-Melou, A.; Greff, S.; Millogo, J.; Fernandez, C.,
Chemical composition of the volatile oil of Laggera aurita Schulz from Burkina-Faso,
Biochem. Syst. Ecol., 2006, 34, 11, 815-818, https://doi.org/10.1016/j.bse.2006.06.005
. [all data]
Pripdeevech and Saansoomchai, 2013
Pripdeevech, P.; Saansoomchai, J.,
Antibacterial activity and chemical composition of essential oil and various extracts of Fagraea fragrans Roxb. flowers,
Chiang Mai J. Sci., 2013, 40, 2, 214-223. [all data]
VOC BinBase, 2012
VOC BinBase,
The volatile compound BinBase (VOC BinBase), 2012, retrieved from http://fiehnlab.ucdavis.edu/projects/VocBinBase and http://binbase.sourceforge.net. [all data]
Skogerson, Wohlgemuth, et al., 2011
Skogerson, K.; Wohlgemuth, G.; Fiehn, O.,
VocBinNase, 2011, retrieved from http://fiehnlab.ucdavis.edu/projects//VocBinBase. [all data]