2-Buten-1-one, 1,3-diphenyl-
- Formula: C16H14O
- Molecular weight: 222.2818
- IUPAC Standard InChIKey: PLELHVCQAULGBH-OUKQBFOZSA-N
- CAS Registry Number: 495-45-4
- Chemical structure:
View 3d structure (requires JavaScript / HTML 5) - Other names: Chalcone, β-methyl-; β-Methylchalcone; Dypnone; 1,3-Diphenyl-2-buten-1-one

Phase change data

Data compiled by: Robert L. Brown and Stephen E. Stein
Quantity | Value | Units | Method | Reference | Comment |
---|---|---|---|---|---|
Tboil | 615.7 | K | N/A | Weast and Grasselli, 1989 |
Reduced pressure boiling point
Tboil (K) | Pressure (bar) | Reference |
---|---|---|
479. to 480. | 0.020 | Frinton Laboratories Inc., 1986 |

Van Den Dool and Kratz RI, non-polar column, temperature ramp

Column type | Active phase | I | Reference | Comment |
---|---|---|---|---|
Capillary | SE-54 | 1985.7 | Shapi and Hesso, 1990 | 25. m/0.32 mm/0.15 μm, He, 40. C @ 1. min, 5. K/min, 280. C @ 15. min |

References

Weast and Grasselli, 1989
CRC Handbook of Data on Organic Compounds, 2nd Editon, Weast,R.C and Grasselli, J.G., ed(s)., CRC Press, Inc., Boca Raton, FL, 1989, 1. [all data]
Frinton Laboratories Inc., 1986
Frinton Laboratories Inc.,
Catalog Number 11, Frinton Laboratories Inc., Vineland, NJ, 1986, 99. [all data]
Shapi and Hesso, 1990
Shapi, M.M.; Hesso, A.,
Thermal decomposition of polystyrene volatile compounds from large-scale pyrolysis,
J. Anal. Appl. Pyrolysis, 1990, 18, 2, 143-161, https://doi.org/10.1016/0165-2370(90)80004-8
. [all data]