3,3,7,7-Tetramethylnonanedioic anhydride
- Formula: C13H22O3
- Molecular weight: 226.3120
- IUPAC Standard InChIKey: HIJQFTSZBHDYKW-UHFFFAOYSA-N
- CAS Registry Number: 49540-31-0
- Chemical structure:
View 3d structure (requires JavaScript / HTML 5) - Species with the same structure:

Phase change data

Data compiled as indicated in comments:
TRC - Thermodynamics Research Center, NIST Boulder Laboratories, Chris Muzny director
AC - William E. Acree, Jr., James S. Chickos
Quantity | Value | Units | Method | Reference | Comment |
---|---|---|---|---|---|
Tfus | 332. | K | N/A | Borgen, 1974 | Uncertainty assigned by TRC = 0.5 K; TRC |
Enthalpy of fusion
ΔfusH (kcal/mol) | Temperature (K) | Reference | Comment |
---|---|---|---|
4.90 | 396.2 | Borgen, Wieczorkowska, et al., 1974 | AC |

References

Borgen, 1974
Borgen, G.,
The Conformations of Some gem-Dimethyl Substituted Cyclic Anhydrides.,
Acta Chem. Scand., 1974, 28b, 13, https://doi.org/10.3891/acta.chem.scand.28b-0013
. [all data]
Borgen, Wieczorkowska, et al., 1974
Borgen, Gerd; Wieczorkowska, Elzbieta; Nielsen, B. Juhl; Åkerström, Stig; Taticchi, A.; Mannervik, Bengt,
The Conformations of Some gem-Dimethyl Substituted Cyclic Anhydrides.,
Acta Chem. Scand., 1974, 28b, 13-17, https://doi.org/10.3891/acta.chem.scand.28b-0013
. [all data]