trans-2-Pinanol
- Formula: C10H18O
- Molecular weight: 154.2493
- IUPAC Standard InChIKey: YYWZKGZIIKPPJZ-SFVIPPHHSA-N
- CAS Registry Number: 4948-29-2
- Chemical structure:
View 3d structure (requires JavaScript / HTML 5) - Stereoisomers:
- Other names: Bicyclo(3.1.1)heptan-2-ol, 2,6,6-trimethyl-, (1α,2β,5α)-; Pinan-2β-ol; 2-Pinanol, trans-; 2,6,6-Trimethylbicyclo(3.1.1)heptan-2-ol, (1α,2β,5α)-; 2,6,6-Trimethylbicyclo[3.1.1]heptan-2-ol-, (1R,2R,5S)-rel-; (E)-Pinan-2-ol; trans-Pinan-2-ol; trans-Pinene hydrate; (E)-Pinene hydrate; NSC 2326

Kovats' RI, non-polar column, temperature ramp

Column type | Active phase | I | Reference | Comment |
---|---|---|---|---|
Capillary | SE-30 | 1135. | Palá-Paúl, Velasco-Negueruela, et al., 2002 | 25. m/0.22 mm/0.25 μm, He, 4. K/min; Tstart: 70. C; Tend: 220. C |
Capillary | DB-5 | 1137. | da Silva, Andrade, et al., 1999 | 30. m/0.25 mm/0.25 μm, He, 3. K/min; Tstart: 60. C; Tend: 240. C |

Kovats' RI, non-polar column, custom temperature program

Column type | Active phase | I | Reference | Comment |
---|---|---|---|---|
Capillary | BP-1 | 1133. | Khan, Verma, et al., 2006 | 30. m/0.32 mm/0.25 μm, N2; Program: 60C => 5C/min => 220C (5min) => 3C/min => 245C(5min) |
Capillary | BP-1 | 1135. | Khan, Srivastava, et al., 2003 | 25. m/0.25 mm/0.25 μm, N2; Program: 60C => 5C/min => 220C (5min) => 3C/min => 245 C (5min) |

Van Den Dool and Kratz RI, non-polar column, temperature ramp

Column type | Active phase | I | Reference | Comment |
---|---|---|---|---|
Capillary | DB-5 | 1151. | Senatore, Napolitano, et al., 2005 | 30. m/0.25 mm/0.25 μm, He, 40. C @ 5. min, 2. K/min, 260. C @ 20. min |
Capillary | HP-5MS | 1121. | Mimica-Dukic, Kujundzic, et al., 2003 | 30. m/0.25 mm/0.25 μm, He, 3. K/min; Tstart: 60. C; Tend: 280. C |
Capillary | RTX-5 | 1140. | Mondello, Zappia, et al., 2002 | 30. m/0.25 mm/0.25 μm, He, 45. C @ 6. min, 3. K/min, 300. C @ 10. min |

Van Den Dool and Kratz RI, non-polar column, custom temperature program

Column type | Active phase | I | Reference | Comment |
---|---|---|---|---|
Capillary | SE-52 | 1138. | Loayza, de Groot, et al., 1999 | 25. m/0.25 mm/0.25 μm, He; Program: 60 0C (8 min) 3 K/min -> 180 0C 20 K/min -> 230 0C |

Van Den Dool and Kratz RI, polar column, custom temperature program

Column type | Active phase | I | Reference | Comment |
---|---|---|---|---|
Capillary | Carbowax 20M | 1522. | Loayza, de Groot, et al., 1999 | 25. m/0.32 mm/0.25 μm, H2; Program: 40 0C (8 min) 3 K/min -> 180 0C 20 K/min -> 230 0C |

Normal alkane RI, non-polar column, temperature ramp

Column type | Active phase | I | Reference | Comment |
---|---|---|---|---|
Capillary | DB-1 | 1088. | Salehi, Asghari, et al., 2007 | 60. m/0.25 mm/0.25 μm, 5. K/min; Tstart: 60. C; Tend: 250. C |
Capillary | HP-5MS | 1141. | Setzer, Noletto, et al., 2005 | 30. m/0.25 mm/0.25 μm, He, 60. C @ 5. min, 3. K/min; Tend: 280. C |
Capillary | CP Sil 5 CB | 1120. | Kanjilal, Kotoky, et al., 2003 | 25. m/0.25 mm/0.25 μm, He, 35. C @ 2.5 min, 5. K/min; Tend: 280. C |
Capillary | DB-5 | 1140. | Bos, Koulman, et al., 2002 | 30. m/0.249 mm/0.25 μm, He, 3. K/min, 300. C @ 5. min; Tstart: 60. C |
Capillary | ZEBRON-5 | 1087. | Öztürk, Akay, et al., 2002 | 6. m/0.25 mm/0.25 μm, He, 40. C @ 5. min, 3. K/min, 200. C @ 15. min |
Capillary | DB-5 | 1118. | Zoghbi, Andrade, et al., 2002 | 30. m/0.25 mm/0.25 μm, He, 3. K/min; Tstart: 60. C; Tend: 240. C |
Capillary | DB-5 | 1127. | Santos-Gomes and Fernandes-Ferreira, 2001 | 30. m/0.25 mm/0.25 μm, H2, 3. K/min; Tstart: 60. C; Tend: 285. C |
Capillary | DB-1 | 1140. | Koulman, 1999 | 25. m/0.25 mm/0.25 μm, He, 4. K/min; Tstart: 50. C; Tend: 290. C |
Capillary | DB-5 | 1137. | Maia, Zohhbi, et al., 1998 | 30. m/0.25 mm/0.25 μm, He, 3. K/min; Tstart: 60. C; Tend: 240. C |

Normal alkane RI, non-polar column, custom temperature program

Column type | Active phase | I | Reference | Comment |
---|---|---|---|---|
Capillary | HP-5MS | 1120. | Cole, Haber, et al., 2007 | 30. m/0.25 mm/0.25 μm, He; Program: 40C(10min) => 3C/min => 200C => 2C/min => 220C |
Capillary | BPX-5 | 1123. | Koba, Sanda, et al., 2004 | 30. m/0.25 mm/0.25 μm, H2; Program: 50 0C (1 min) 3 0C/min -> 150 0C 5 0C/min -> 250 0C (5 min) |
Capillary | SE-30 | 1110. | Vinogradov, 2004 | Program: not specified |
Capillary | DB-5 | 1126. | Sanda, Koba, et al., 1998 | 30. m/0.25 mm/0.25 μm, N2; Program: 45C(5min) => 2C/min => 200C => 5C/min => 250C |

References

Palá-Paúl, Velasco-Negueruela, et al., 2002
Palá-Paúl, J.; Velasco-Negueruela, A.; Pérez-Alonso, M.J.; Sanz, J.,
Essential oil composition of the aerial parts of Cachrys sicula L.,
Flavour Fragr. J., 2002, 17, 1, 64-68, https://doi.org/10.1002/ffj.1042
. [all data]
da Silva, Andrade, et al., 1999
da Silva, M.H.L.; Andrade, E.H.A.; Zoghbi, M.G.B.; Luz, A.I.R.; da Silva, J.D.; Maia, J.G.S.,
The essential oils of Lantana camara L. occurring in North Brazil,
Flavour Fragr. J., 1999, 14, 4, 208-210, https://doi.org/10.1002/(SICI)1099-1026(199907/08)14:4<208::AID-FFJ811>3.0.CO;2-F
. [all data]
Khan, Verma, et al., 2006
Khan, M.; Verma, S.C.; Srivastava, S.K.; Shawl, A.S.; Syamsundar, K.V.; Khanuja, S.P.S.; Kumar, T.,
Essential oil composition of Taxus wallichiana Zucc. from the Northern Himalayan region of India,
Flavour Fragr. J., 2006, 21, 5, 772-775, https://doi.org/10.1002/ffj.1682
. [all data]
Khan, Srivastava, et al., 2003
Khan, M.; Srivastava, S.K.; Jain, N.; Syamasundar, K.V.; Yadav, A.K.,
Chemical composition of fruit and stem essential oils of Lantana camara from northern India,
Flavour Fragr. J., 2003, 18, 5, 376-379, https://doi.org/10.1002/ffj.1197
. [all data]
Senatore, Napolitano, et al., 2005
Senatore, F.; Napolitano, F.; Arnold, N.A.; Bruno, M.; Herz, W.,
Composition and antimicrobial activity of the essential oil of Achillea falcata L. (Asteraceae),
Flavour Fragr. J., 2005, 20, 3, 291-294, https://doi.org/10.1002/ffj.1411
. [all data]
Mimica-Dukic, Kujundzic, et al., 2003
Mimica-Dukic, N.; Kujundzic, S.; Sokovic, M.; Couladis, M.,
Essential oil composition and antifungal activity of Foeniculum vulgare Mill. obtained by different distillation conditions,
Phytother. Res., 2003, 17, 4, 368-371, https://doi.org/10.1002/ptr.1159
. [all data]
Mondello, Zappia, et al., 2002
Mondello, L.; Zappia, G.; Cotroneo, A.; Bonaccorsi, I.; Chowdhury, J.U.; Yusuf, M.; Dugo, G.,
Studies on the essential oil-bearing plants of Bangladesh. Part VIII. Composition of some Ocimum oils O. basilicum L. var. purpurascens; O. sanctum L. green; O. sanctum L. purple; O. americanum L., citral type; O. americanum L., camphor type,
Flavour Fragr. J., 2002, 17, 5, 335-340, https://doi.org/10.1002/ffj.1108
. [all data]
Loayza, de Groot, et al., 1999
Loayza, I.; de Groot, W.; Lorenzo, D.; Dellacassa, E.; Mondello, L.; Dugo, G.,
Composition of the essential oil of Porophyllum ruderale (Jacq.) Cass. from Bolivia,
Flavour Fragr. J., 1999, 14, 6, 393-398, https://doi.org/10.1002/(SICI)1099-1026(199911/12)14:6<393::AID-FFJ849>3.0.CO;2-5
. [all data]
Salehi, Asghari, et al., 2007
Salehi, P.; Asghari, B.; Mohammadi, F.,
Hydrodistillation-Headspace Solvent Microextraction: An Efficient Method for Analysis of the Essential Oil from the Seeds of Foeniculum vulgare Mill.,
Chromatographia, 2007, 65, 1-2, 119-122, https://doi.org/10.1365/s10337-006-0102-9
. [all data]
Setzer, Noletto, et al., 2005
Setzer, W.N.; Noletto, J.A.; Lawton, R.O.; Haber, W.A.,
Leaf essential oil composition of five Zanthoxylum species from Monteverde, Costa Rica,
Molecular Diversity, 2005, 9, 1-3, 3-13, https://doi.org/10.1007/s11030-005-1298-6
. [all data]
Kanjilal, Kotoky, et al., 2003
Kanjilal, P.B.; Kotoky, R.; Singh, R.S.,
Chemical composition of the leaf oil of Altingia excelsa Nornha,
Flavour Fragr. J., 2003, 18, 5, 449-450, https://doi.org/10.1002/ffj.1250
. [all data]
Bos, Koulman, et al., 2002
Bos, R.; Koulman, A.; Woerdenbag, H.J.; Quax, W.J.; Pras, N.,
Volatile components from Anthriscus sylvestris (L.) Hoffm.,
J. Chromatogr. A, 2002, 966, 1-2, 233-238, https://doi.org/10.1016/S0021-9673(02)00704-5
. [all data]
Öztürk, Akay, et al., 2002
Öztürk, M.; Akay, F.; Duru, M.E.; Bilsel, G.; Harmandar, M.,
The volatile oil constituents and biological activity of aerial part of Inula heterolepis Boiss.,
Proc. ICNP-2002 - Trabzon/Turkiye, 2002, 298-303. [all data]
Zoghbi, Andrade, et al., 2002
Zoghbi, M.G.B.; Andrade, E.H.A.; da Silva, M.H.; Maia, J.G.S.; Luz, A.I.R.; da Silva, J.D.,
Chemical variation in the essential oils of Hyptis crenata Pohl ex Benth.,
Flavour Fragr. J., 2002, 17, 1, 5-8, https://doi.org/10.1002/ffj.1031
. [all data]
Santos-Gomes and Fernandes-Ferreira, 2001
Santos-Gomes, P.C.; Fernandes-Ferreira, M.,
Organ- and season-dependent variation in the essential oil composition of Salvia officinalis L. cultivated at two different sites,
J. Agric. Food Chem., 2001, 49, 6, 2908-2916, https://doi.org/10.1021/jf001102b
. [all data]
Koulman, 1999
Koulman, A.,
Podophyllotoxin: a study of biosynthesis, evolution, function, and use of podophyllotoxin and related lignans, University Library Groningen, Nederlands, 1999, 188, retrieved from http://www.ub.rug.nl/eldoc/dis/science/a.koulman/. [all data]
Maia, Zohhbi, et al., 1998
Maia, J.G.S.; Zohhbi, M.G.B.; Andrade, E.H.A.; Santos, A.S.; da Silva, M.H.L.; Luz, A.I.R.; Bastos, C.N.,
Constituents of the essential oil of Piper aduncum L. growing wild in the Amazon region,
Flavour Fragr. J., 1998, 13, 4, 269-272, https://doi.org/10.1002/(SICI)1099-1026(1998070)13:4<269::AID-FFJ744>3.0.CO;2-A
. [all data]
Cole, Haber, et al., 2007
Cole, R.A.; Haber, W.A.; Setzer, W.N.,
Chemical composition of essential oils of seven species of Eugenia from Monteverde, Costa Rica,
Biochem. Syst. Ecol., 2007, 35, 12, 877-886, https://doi.org/10.1016/j.bse.2007.06.013
. [all data]
Koba, Sanda, et al., 2004
Koba, K.; Sanda, K.; Raynaud, C.; Nenonene, Y.A.; Millet, J.; Chaumont, J.P.,
Activités antimicrobiennes d'huiles essentielles de trois Cymbopogon sp. africains vis-àvis de germes pathogènes d'animaux de compagnie,
Ann. Med. Vet., 2004, 148, 202-206. [all data]
Vinogradov, 2004
Vinogradov, B.A.,
Production, composition, properties and application of essential oils, 2004, retrieved from http://viness.narod.ru. [all data]
Sanda, Koba, et al., 1998
Sanda, K.; Koba, K.; Nambo, P.; Gaset, A.,
Chemical investigation of Ocimum species growing in Togo,
Flavour Fragr. J., 1998, 13, 4, 226-232, https://doi.org/10.1002/(SICI)1099-1026(1998070)13:4<226::AID-FFJ717>3.0.CO;2-H
. [all data]