Piperidine, 1-butyl-
- Formula: C9H19N
- Molecular weight: 141.2539
- IUPAC Standard InChIKey: AXWLKJWVMMAXBD-UHFFFAOYSA-N
- CAS Registry Number: 4945-48-6
- Chemical structure:
View 3d structure (requires JavaScript / HTML 5) - Other names: N-Butylpiperidine; 1-Butylpiperidine

Condensed phase thermochemistry data

Data compiled by: Hussein Y. Afeefy, Joel F. Liebman, and Stephen E. Stein
Quantity | Value | Units | Method | Reference | Comment |
---|---|---|---|---|---|
ΔfH°liquid | -171.8 ± 8.5 | kJ/mol | Ccb | Prochazka, Krestanova, et al., 1970 | |
Quantity | Value | Units | Method | Reference | Comment |
ΔcH°liquid | -6085.2 ± 8.5 | kJ/mol | Ccb | Prochazka, Krestanova, et al., 1970 |

Phase change data

Data compiled as indicated in comments:
BS - Robert L. Brown and Stephen E. Stein
TRC - Thermodynamics Research Center, NIST Boulder Laboratories, Chris Muzny director
AC - William E. Acree, Jr., James S. Chickos
Quantity | Value | Units | Method | Reference | Comment |
---|---|---|---|---|---|
Tboil | 448. ± 5. | K | AVG | N/A | Average of 6 values; Individual data points |
Quantity | Value | Units | Method | Reference | Comment |
ΔvapH° | 48.9 ± 0.2 | kJ/mol | GS | Verevkin, 1998 | Based on data from 275. to 313. K.; AC |
Enthalpy of vaporization
ΔvapH (kJ/mol) | Temperature (K) | Method | Reference | Comment |
---|---|---|---|---|
49.2 ± 0.2 | 294. | GS | Verevkin, 1998 | Based on data from 275. to 313. K.; AC |

References

Prochazka, Krestanova, et al., 1970
Prochazka, M.; Krestanova, V.; Palecek, M.; Pecka, K.,
The heats of formation of some enamines,
Collect. Czech. Chem. Commun., 1970, 35, 3813-3817. [all data]
Verevkin, 1998
Verevkin, Sergey P.,
Structural Chemistry, 1998, 9, 2, 113-119, https://doi.org/10.1023/A:1022459803871
. [all data]