Anabasine
- Formula: C10H14N2
- Molecular weight: 162.2316
- IUPAC Standard InChIKey: MTXSIJUGVMTTMU-SNVBAGLBSA-N
- CAS Registry Number: 494-52-0
- Chemical structure:
View 3d structure (requires JavaScript / HTML 5) - Stereoisomers:
- Other names: Pyridine, 3-(2-piperidinyl)-, (S)-; Piperidine, 2-(3-pyridyl)-; (-)-Anabasine; (-)-2-(3'-Pyridyl)piperidine; Anabasin; Anabazin; Neonicotine; Neonikotin; (S)-(-)-Anabasine; L-3-(2'-Piperidyl)pyridine; Pyridine, 3-(2-piperidyl)-; 3-(2-Piperidinyl)pyridine; (S)-Anabasine; NSC 87504; 2-(3-Pyridinyl)piperidine

Phase change data

Data compiled as indicated in comments:
BS - Robert L. Brown and Stephen E. Stein
AC - William E. Acree, Jr., James S. Chickos
Quantity | Value | Units | Method | Reference | Comment |
---|---|---|---|---|---|
Tboil | 549.2 | K | N/A | Weast and Grasselli, 1989 | BS |
Reduced pressure boiling point
Tboil (K) | Pressure (bar) | Reference | Comment |
---|---|---|---|
378.2 | 0.003 | Weast and Grasselli, 1989 | BS |
Enthalpy of vaporization
ΔvapH (kJ/mol) | Temperature (K) | Reference | Comment |
---|---|---|---|
49.5 | 448. | Gorbachev, 1934 | Based on data from 373. to 523. K.; AC |

Van Den Dool and Kratz RI, non-polar column, temperature ramp

Column type | Active phase | I | Reference | Comment |
---|---|---|---|---|
Capillary | VF-5MS | 1525. | Tretyakov, 2014 | 30. m/0.25 mm/0.25 μm, He; Tstart: 60. C; Tend: 270. C |

References

Weast and Grasselli, 1989
CRC Handbook of Data on Organic Compounds, 2nd Editon, Weast,R.C and Grasselli, J.G., ed(s)., CRC Press, Inc., Boca Raton, FL, 1989, 1. [all data]
Gorbachev, 1934
Gorbachev, S.V.,
Educ. Psychol. Meas., 1934, 7, 388. [all data]
Tretyakov, 2014
Tretyakov, K.V.,
Retention Data. NIST Mass Spectrometry Data Center., NIST Mass Spectrometry Data Center, 2014. [all data]