Benz[e]indan
- Formula: C13H12
- Molecular weight: 168.2344
- IUPAC Standard InChIKey: HQYLCMKCKULOEV-UHFFFAOYSA-N
- CAS Registry Number: 4944-94-9
- Chemical structure:
View 3d structure (requires JavaScript / HTML 5) - Other names: 2,3-dihydro-1H-benz[e]indene; 1h-Benz[e]indene, 2,3-dihydro-

Phase change data

Data compiled by: Robert L. Brown and Stephen E. Stein
Reduced pressure boiling point
Tboil (K) | Pressure (bar) | Reference |
---|---|---|
567. to 568. | 1.01 | Buckingham and Donaghy, 1982 |
363. to 373. | 0.00005 | Buckingham and Donaghy, 1982 |

Normal alkane RI, non-polar column, temperature ramp

Column type | Active phase | I | Reference | Comment |
---|---|---|---|---|
Capillary | Ultra-1 | 1578. | Elizalde-González, Hutfliess, et al., 1996 | 50. m/0.2 mm/0.33 μm, H2, 3. K/min, 300. C @ 35. min; Tstart: 60. C |

References

Buckingham and Donaghy, 1982
Buckingham, J.; Donaghy, S.M.,
Dictionary of Organic Compounds: Fifth Edition, Chapman and Hall, New York, 1982, 1. [all data]
Elizalde-González, Hutfliess, et al., 1996
Elizalde-González, M.P.; Hutfliess, M.; Hedden, K.,
Retention index system, adsorption characteristics, and sructure correlations of polycyclic aromatic hydrocarbons in fuels,
J. Hi. Res. Chromatogr., 1996, 19, 6, 345-352, https://doi.org/10.1002/jhrc.1240190608
. [all data]