5-Undecene
- Formula: C11H22
- Molecular weight: 154.2924
- IUPAC Standard InChIKey: NGCRXXLKJAAUQQ-UHFFFAOYSA-N
- CAS Registry Number: 4941-53-1
- Chemical structure:
View 3d structure (requires JavaScript / HTML 5) - Stereoisomers:

Phase change data

Data compiled by: Thermodynamics Research Center, NIST Boulder Laboratories, Chris Muzny director
Quantity | Value | Units | Method | Reference | Comment |
---|---|---|---|---|---|
Tboil | 466.6 | K | N/A | Puzitskii, Eidus, et al., 1966 | Uncertainty assigned by TRC = 2. K |
Tboil | 461.65 | K | N/A | Komarewsky and Kritchevsky, 1943 | Uncertainty assigned by TRC = 3. K |

Kovats' RI, non-polar column, temperature ramp

View large format table.

Column type Active phase I Reference Comment
CapillaryDB-11090.Takeoka, Perrino, et al., 199660. m/0.25 mm/0.25 μm, 30. C @ 4. min, 2. K/min; Tend: 220. C

Normal alkane RI, non-polar column, temperature ramp

View large format table.

Column type Active phase I Reference Comment
CapillaryHP-5MS1092.Kim, El-Aty, et al., 200630. m/0.25 mm/0.25 μm, He, 50. C @ 4. min, 5. K/min, 280. C @ 10. min

References

Puzitskii, Eidus, et al., 1966
Puzitskii, K.V.; Eidus, Y.T.; Ryabova, K.G.,
Synthesis of Olefins with a Double Bond in the Middle of the Molecule from Carbon MOnoxide and Organimagnesium Compounds,
Izv. Akad. Nauk SSSR, Ser. Khim., 1966, 1966, 1810-4. [all data]
Komarewsky and Kritchevsky, 1943
Komarewsky, V.I.; Kritchevsky, T.H.,
Synthesis of Olefin Hydrocarbons by Catalytic Condensation and Dehydration of Aliphatic Aldehydes,
J. Am. Chem. Soc., 1943, 65, 547-8. [all data]