chlornaphazine
- Formula: C14H15Cl2N
- Molecular weight: 268.182
- CAS Registry Number: 494-03-1

Phase change data

Data compiled by: Robert L. Brown and Stephen E. Stein
Quantity | Value | Units | Method | Reference | Comment |
---|---|---|---|---|---|
Tfus | 327. to 329. | K | N/A | Buckingham and Donaghy, 1982 |
Reduced pressure boiling point
Tboil (K) | Pressure (atm) | Reference |
---|---|---|
483.2 | 0.007 | Weast and Grasselli, 1989 |
483. | 0.007 | Buckingham and Donaghy, 1982 |

References

Buckingham and Donaghy, 1982
Buckingham, J.; Donaghy, S.M.,
Dictionary of Organic Compounds: Fifth Edition, Chapman and Hall, New York, 1982, 1. [all data]
Weast and Grasselli, 1989
CRC Handbook of Data on Organic Compounds, 2nd Editon, Weast,R.C and Grasselli, J.G., ed(s)., CRC Press, Inc., Boca Raton, FL, 1989, 1. [all data]
Lang (editor), 1966
Lang (editor), L.,
Absorption Spectra in the Ultraviolet and Visible Region, 1966, 7, 173. [all data]