Ethyl maltol
- Formula: C7H8O3
- Molecular weight: 140.1366
- IUPAC Standard InChIKey: YIKYNHJUKRTCJL-UHFFFAOYSA-N
- CAS Registry Number: 4940-11-8
- Chemical structure:
View 3d structure (requires JavaScript / HTML 5) - Other names: 4H-Pyran-4-one, 2-ethyl-3-hydroxy-; 2-Ethyl-3-hydroxy-4H-pyran-4-one; 2-Ethylpyromeconic acid; 3-Hydroxy-2-ethyl-γ-pyrone; 3-Hydroxy-2-ethyl-1,4-pyrone; 3-Hydroxy-2-ethyl-4-pyrone; 3-Hydroxy-2-ethyl-4H-pyran-4-one; 2-Ethyl-3-hydroxy-4-pyrone; Veltol plus

Normal alkane RI, non-polar column, temperature ramp

Column type | Active phase | I | Reference | Comment |
---|---|---|---|---|
Capillary | SLB-5MS | 1193. | Risticevic, Carasek, et al., 2008 | 10. m/0.18 mm/0.18 μm, Helium, 40. C @ 1.5 min, 10. K/min; Tend: 295. C |

Normal alkane RI, non-polar column, custom temperature program

Column type | Active phase | I | Reference | Comment |
---|---|---|---|---|
Capillary | SLB-5MS | 1199. | Risticevic, Carasek, et al., 2008 | 10. m/0.18 mm/0.18 μm, Helium; Program: not specified |

Normal alkane RI, polar column, temperature ramp

Column type | Active phase | I | Reference | Comment |
---|---|---|---|---|
Capillary | HP-FFAP | 2050. | Wanakhachornkrai and Lertsiri, 9999 | 25. m/0.32 mm/0.50 μm, Helium, 15. K/min; Tstart: 45. C; Tend: 220. C |
Capillary | HP-FFAP | 2052. | Wanakhachornkrai and Lertsiri, 9999 | 25. m/0.32 mm/0.50 μm, Helium, 15. K/min; Tstart: 45. C; Tend: 220. C |
Capillary | HP-FFAP | 2052. | Wanakhachornkrai and Lertsiri, 2003 | 25. m/0.32 mm/0.5 μm, He, 15. K/min; Tstart: 45. C; Tend: 220. C |
Capillary | HP-FFAP | 2050. | Wanakhachornkrai and Lertsiri, 2003 | 25. m/0.32 mm/0.5 μm, He, 15. K/min; Tstart: 45. C; Tend: 220. C |

References

Risticevic, Carasek, et al., 2008
Risticevic, S.; Carasek, E.; Pawliszyn, J.,
Headspace solid-phase microextraction-gas chromatographic-time-of-flight mass spectrometric methodology for geographical origin verification of coffee,
Anal. Chim. Acta, 2008, 617, 1-2, 72-84, https://doi.org/10.1016/j.aca.2008.04.009
. [all data]
Wanakhachornkrai and Lertsiri, 9999
Wanakhachornkrai, P.; Lertsiri, S.,
Comparison of determination method for volatile compounds in Thai soy sauce,
Analytical, Nutritional and Clinical Methods, 9999, 1-11. [all data]
Wanakhachornkrai and Lertsiri, 2003
Wanakhachornkrai, P.; Lertsiri, S.,
Analytical, nutritional, and clinical methods. Comparison of determination method for volatile compounds in Thai soy sauce,
Food Chem., 2003, 83, 4, 619-629, https://doi.org/10.1016/S0308-8146(03)00256-5
. [all data]